BDBM50350472 640/359::Anaptivan::CEFUROXIME::Ceftin
SMILES: CO\N=C(\C(=O)N[C@H]1[C@H]2SCC(COC(N)=O)=C(N2C1=O)C(O)=O)c1ccco1
InChI Key: InChIKey=JFPVXVDWJQMJEE-SWWZKJRFSA-N
Data: 4 KI  1 Kd  1 ITC
Activity Spreadsheet -- Enzyme Inhibition Constant Data from BindingDB
Found 5 hits for monomerid = 50350472
Trg + Lig
Ki
nM
ΔG°
kcal/mole
IC50
nM
Kd
nM
EC50/IC50
nM
koff
s-1
kon
M-1s-1
pHTemp
°C
Oligopeptide transporter, kidney isoform
(Rattus norvegicus)
BDBM50350472
(640/359 | Anaptivan | CEFUROXIME | Ceftin)
Show SMILES CO\N=C(\C(=O)N[C@H]1[C@H]2SCC(COC(N)=O)=C(N2C1=O)C(O)=O)c1ccco1 |c:16|
Show InChI InChI=1S/C16H16N4O8S/c1-26-19-9(8-3-2-4-27-8)12(21)18-10-13(22)20-11(15(23)24)7(5-28-16(17)25)6-29-14(10)20/h2-4,10,14H,5-6H2,1H3,(H2,17,25)(H,18,21)(H,23,24)/b19-9+/t10-,14-/m1/s1
Reactome pathway
>3.00E+3n/an/an/an/an/an/an/an/a
Biozentrum of the Martin-Luther-University Halle-Wittenberg
Curated by ChEMBL
Assay Description
TP_TRANSPORTER: inhibition of Gly-Sar uptake (pH6.0) in SKPT cells
Eur J Pharm Biopharm 59: 17-24 (2004)
Article DOI: 10.1016/j.ejpb.2004.07.008
BindingDB Entry DOI: 10.7270/Q2TT4S7H
Oligopeptide transporter small intestine isoform
(Homo sapiens (Human))
BDBM50350472
(640/359 | Anaptivan | CEFUROXIME | Ceftin)
Show SMILES CO\N=C(\C(=O)N[C@H]1[C@H]2SCC(COC(N)=O)=C(N2C1=O)C(O)=O)c1ccco1 |c:16|
Show InChI InChI=1S/C16H16N4O8S/c1-26-19-9(8-3-2-4-27-8)12(21)18-10-13(22)20-11(15(23)24)7(5-28-16(17)25)6-29-14(10)20/h2-4,10,14H,5-6H2,1H3,(H2,17,25)(H,18,21)(H,23,24)/b19-9+/t10-,14-/m1/s1
Reactome pathway
>5.00E+6n/an/an/an/an/an/an/an/a
Biozentrum of the Martin-Luther-University Halle-Wittenberg
Curated by ChEMBL
Assay Description
TP_TRANSPORTER: inhibition of Gly-Sar uptake (pH6.0) in Caco-2 cells
Eur J Pharm Biopharm 59: 17-24 (2004)
Article DOI: 10.1016/j.ejpb.2004.07.008
BindingDB Entry DOI: 10.7270/Q2TT4S7H
Oligopeptide transporter, kidney isoform
(Rattus norvegicus)
BDBM50350472
(640/359 | Anaptivan | CEFUROXIME | Ceftin)
Show SMILES CO\N=C(\C(=O)N[C@H]1[C@H]2SCC(COC(N)=O)=C(N2C1=O)C(O)=O)c1ccco1 |c:16|
Show InChI InChI=1S/C16H16N4O8S/c1-26-19-9(8-3-2-4-27-8)12(21)18-10-13(22)20-11(15(23)24)7(5-28-16(17)25)6-29-14(10)20/h2-4,10,14H,5-6H2,1H3,(H2,17,25)(H,18,21)(H,23,24)/b19-9+/t10-,14-/m1/s1
Reactome pathway
1.26E+7n/an/an/an/an/an/an/an/a
Biozentrum of the Martin-Luther-University Halle-Wittenberg
Curated by ChEMBL
Assay Description
TP_TRANSPORTER: inhibition of Gly-Sar uptake (pH6.0) in SKPT cells
Eur J Pharm Biopharm 59: 17-24 (2004)
Article DOI: 10.1016/j.ejpb.2004.07.008
BindingDB Entry DOI: 10.7270/Q2TT4S7H
Oligopeptide transporter small intestine isoform
(Homo sapiens (Human))
BDBM50350472
(640/359 | Anaptivan | CEFUROXIME | Ceftin)
Show SMILES CO\N=C(\C(=O)N[C@H]1[C@H]2SCC(COC(N)=O)=C(N2C1=O)C(O)=O)c1ccco1 |c:16|
Show InChI InChI=1S/C16H16N4O8S/c1-26-19-9(8-3-2-4-27-8)12(21)18-10-13(22)20-11(15(23)24)7(5-28-16(17)25)6-29-14(10)20/h2-4,10,14H,5-6H2,1H3,(H2,17,25)(H,18,21)(H,23,24)/b19-9+/t10-,14-/m1/s1
Reactome pathway
2.60E+7n/an/an/an/an/an/an/an/a
Biozentrum of the Martin-Luther-University Halle-Wittenberg
Curated by ChEMBL
Assay Description
TP_TRANSPORTER: inhibition of Gly-Sar uptake (pH6.0) in Caco-2 cells
Eur J Pharm Biopharm 59: 17-24 (2004)
Article DOI: 10.1016/j.ejpb.2004.07.008
BindingDB Entry DOI: 10.7270/Q2TT4S7H
Gcn5-related N-acetyltransferases (GNAT) superfamily protein PA4794 (PA4794)
(Pseudomonas aeruginosa)
BDBM50350472
(640/359 | Anaptivan | CEFUROXIME | Ceftin)
Show SMILES CO\N=C(\C(=O)N[C@H]1[C@H]2SCC(COC(N)=O)=C(N2C1=O)C(O)=O)c1ccco1 |c:16|
Show InChI InChI=1S/C16H16N4O8S/c1-26-19-9(8-3-2-4-27-8)12(21)18-10-13(22)20-11(15(23)24)7(5-28-16(17)25)6-29-14(10)20/h2-4,10,14H,5-6H2,1H3,(H2,17,25)(H,18,21)(H,23,24)/b19-9+/t10-,14-/m1/s1
n/an/an/a 1.77E+5n/an/an/a7.525
University of Virginia
Assay Description
Isothermal titration calorimetry (ITC) measurements were performed at 25 °C using an iTC200 calorimeter (MicroCal). Preparations of purified pr...
J Biol Chem 288: 30223-35 (2013)
Article DOI: 10.1074/jbc.M113.501353
BindingDB Entry DOI: 10.7270/Q22N514W
Activity Spreadsheet -- ITC Data from BindingDB
Found 1 hit for monomerid = 50350472
Cell (A)Syringe (B)Cell
Syringe
Cell + Syr
ΔG°
kcal/mole
-TΔS°
kcal/mole
ΔH°
kcal/mole
log KpHTemp
°C
Gcn5-related N-acetyltransferases (GNAT) superfamily protein PA4794 (PA4794)
(Pseudomonas aeruginosa)
BDBM50350472
JPEG
(640/359 | Anaptivan | CEFUROXIME | Ceftin)
-5.123.16-8.283.767.525
University of Virginia
J Biol Chem 288: 30223-35 (2013)