BDBM50350704 CHEMBL1814829
SMILES: CCCCCC(=O)CC(=O)N[C@H]1CCSC1=O
InChI Key: InChIKey=JNXSGGJSWVMKAD-JTQLQIEISA-N
Data: 1 IC50  1 EC50
Activity Spreadsheet -- Enzyme Inhibition Constant Data from BindingDB
Found 2 hits for monomerid = 50350704
Trg + Lig
Ki
nM
ΔG°
kcal/mole
IC50
nM
Kd
nM
EC50/IC50
nM
koff
s-1
kon
M-1s-1
pHTemp
°C
Transcriptional activator protein luxR
(Vibrio fischeri)
BDBM50350704
(CHEMBL1814829)
Show SMILES CCCCCC(=O)CC(=O)N[C@H]1CCSC1=O |r|
Show InChI InChI=1S/C12H19NO3S/c1-2-3-4-5-9(14)8-11(15)13-10-6-7-17-12(10)16/h10H,2-8H2,1H3,(H,13,15)/t10-/m0/s1
n/an/a 350n/an/an/an/an/an/a
University of Wisconsin-Madison
Curated by ChEMBL
Assay Description
Antagonist activity at Vibrio fischeri ESI 114 (delta-LuxI) LuxR assessed as inhibition of OdDHL-induced quorum sensing activation after 8 hrs by bet...
Bioorg Med Chem 19: 4820-8 (2011)
Article DOI: 10.1016/j.bmc.2011.06.071
BindingDB Entry DOI: 10.7270/Q27D2W47
Transcriptional activator protein traR
(Rhizobium radiobacter)
BDBM50350704
(CHEMBL1814829)
Show SMILES CCCCCC(=O)CC(=O)N[C@H]1CCSC1=O |r|
Show InChI InChI=1S/C12H19NO3S/c1-2-3-4-5-9(14)8-11(15)13-10-6-7-17-12(10)16/h10H,2-8H2,1H3,(H,13,15)/t10-/m0/s1
n/an/an/an/a 2.00E+4n/an/an/an/a
University of Wisconsin-Madison
Curated by ChEMBL
Assay Description
Agonist activity at Agrobacterium tumefaciens WCF (pCF372) TraR after 8 hrs by beta-galactosidase reporter gene assay relative to OdDHL
Bioorg Med Chem 19: 4820-8 (2011)
Article DOI: 10.1016/j.bmc.2011.06.071
BindingDB Entry DOI: 10.7270/Q27D2W47