BDBM50350810 CHEMBL1819138
SMILES: Cc1[nH]c2ccccc2c1CCN(CCF)Cc1ccc(\C=C\C(=O)NO)cc1
InChI Key: InChIKey=RYJKZDLYHRDHFV-ZHACJKMWSA-N
Data: 2 IC50
Activity Spreadsheet -- Enzyme Inhibition Constant Data from BindingDB
Found 2 hits for monomerid = 50350810
Trg + Lig
Ki
nM
ΔG°
kcal/mole
IC50
nM
Kd
nM
EC50/IC50
nM
koff
s-1
kon
M-1s-1
pHTemp
°C
Potassium voltage-gated channel subfamily H member 2
(Homo sapiens (Human))
BDBM50350810
(CHEMBL1819138)
Show SMILES Cc1[nH]c2ccccc2c1CCN(CCF)Cc1ccc(\C=C\C(=O)NO)cc1
Show InChI InChI=1S/C23H26FN3O2/c1-17-20(21-4-2-3-5-22(21)25-17)12-14-27(15-13-24)16-19-8-6-18(7-9-19)10-11-23(28)26-29/h2-11,25,29H,12-16H2,1H3,(H,26,28)/b11-10+
Reactome pathway
n/an/a 5.77E+3n/an/an/an/an/an/a
Novartis Institutes for Biomedical Research
Curated by ChEMBL
Assay Description
Inhibition of human ERG by radioligand binding assay
J Med Chem 54: 4752-72 (2011)
Article DOI: 10.1021/jm200388e
BindingDB Entry DOI: 10.7270/Q23N24DW
Histone deacetylase 1
(Homo sapiens (Human))
BDBM50350810
(CHEMBL1819138)
Show SMILES Cc1[nH]c2ccccc2c1CCN(CCF)Cc1ccc(\C=C\C(=O)NO)cc1
Show InChI InChI=1S/C23H26FN3O2/c1-17-20(21-4-2-3-5-22(21)25-17)12-14-27(15-13-24)16-19-8-6-18(7-9-19)10-11-23(28)26-29/h2-11,25,29H,12-16H2,1H3,(H,26,28)/b11-10+
NCI pathway
Reactome pathway
n/an/a 13n/an/an/an/an/an/a
Novartis Institutes for Biomedical Research
Curated by ChEMBL
Assay Description
Inhibition of HDAC1
J Med Chem 54: 4752-72 (2011)
Article DOI: 10.1021/jm200388e
BindingDB Entry DOI: 10.7270/Q23N24DW