BDBM50350813 CHEMBL1819141
SMILES: CCCN(CCc1c[nH]c2ccccc12)Cc1ccc(\C=C\C(=O)NO)cc1
InChI Key: InChIKey=BQCWQIOZJSBQCJ-VAWYXSNFSA-N
Data: 2 IC50
Activity Spreadsheet -- Enzyme Inhibition Constant Data from BindingDB
Found 2 hits for monomerid = 50350813
Trg + Lig
Ki
nM
ΔG°
kcal/mole
IC50
nM
Kd
nM
EC50/IC50
nM
koff
s-1
kon
M-1s-1
pHTemp
°C
Potassium voltage-gated channel subfamily H member 2
(Homo sapiens (Human))
BDBM50350813
(CHEMBL1819141)
Show SMILES CCCN(CCc1c[nH]c2ccccc12)Cc1ccc(\C=C\C(=O)NO)cc1
Show InChI InChI=1S/C23H27N3O2/c1-2-14-26(15-13-20-16-24-22-6-4-3-5-21(20)22)17-19-9-7-18(8-10-19)11-12-23(27)25-28/h3-12,16,24,28H,2,13-15,17H2,1H3,(H,25,27)/b12-11+
Reactome pathway
n/an/a 6.68E+3n/an/an/an/an/an/a
Novartis Institutes for Biomedical Research
Curated by ChEMBL
Assay Description
Inhibition of human ERG by radioligand binding assay
J Med Chem 54: 4752-72 (2011)
Article DOI: 10.1021/jm200388e
BindingDB Entry DOI: 10.7270/Q23N24DW
Histone deacetylase 1
(Homo sapiens (Human))
BDBM50350813
(CHEMBL1819141)
Show SMILES CCCN(CCc1c[nH]c2ccccc12)Cc1ccc(\C=C\C(=O)NO)cc1
Show InChI InChI=1S/C23H27N3O2/c1-2-14-26(15-13-20-16-24-22-6-4-3-5-21(20)22)17-19-9-7-18(8-10-19)11-12-23(27)25-28/h3-12,16,24,28H,2,13-15,17H2,1H3,(H,25,27)/b12-11+
NCI pathway
Reactome pathway
n/an/a 12n/an/an/an/an/an/a
Novartis Institutes for Biomedical Research
Curated by ChEMBL
Assay Description
Inhibition of HDAC1
J Med Chem 54: 4752-72 (2011)
Article DOI: 10.1021/jm200388e
BindingDB Entry DOI: 10.7270/Q23N24DW