BDBM50350816 CHEMBL1819255
SMILES: ONC(=O)\C=C\c1ccc(CNCCc2c([nH]c3ccccc23)-c2ccccc2)cc1
InChI Key: InChIKey=KFKMAKYLZATHBX-CCEZHUSRSA-N
Data: 2 IC50
Activity Spreadsheet -- Enzyme Inhibition Constant Data from BindingDB
Found 2 hits for monomerid = 50350816
Trg + Lig
Ki
nM
ΔG°
kcal/mole
IC50
nM
Kd
nM
EC50/IC50
nM
koff
s-1
kon
M-1s-1
pHTemp
°C
Potassium voltage-gated channel subfamily H member 2
(Homo sapiens (Human))
BDBM50350816
(CHEMBL1819255)
Show SMILES ONC(=O)\C=C\c1ccc(CNCCc2c([nH]c3ccccc23)-c2ccccc2)cc1
Show InChI InChI=1S/C26H25N3O2/c30-25(29-31)15-14-19-10-12-20(13-11-19)18-27-17-16-23-22-8-4-5-9-24(22)28-26(23)21-6-2-1-3-7-21/h1-15,27-28,31H,16-18H2,(H,29,30)/b15-14+
Reactome pathway
n/an/a 1.48E+3n/an/an/an/an/an/a
Novartis Institutes for Biomedical Research
Curated by ChEMBL
Assay Description
Inhibition of human ERG by radioligand binding assay
J Med Chem 54: 4752-72 (2011)
Article DOI: 10.1021/jm200388e
BindingDB Entry DOI: 10.7270/Q23N24DW
Histone deacetylase 1
(Homo sapiens (Human))
BDBM50350816
(CHEMBL1819255)
Show SMILES ONC(=O)\C=C\c1ccc(CNCCc2c([nH]c3ccccc23)-c2ccccc2)cc1
Show InChI InChI=1S/C26H25N3O2/c30-25(29-31)15-14-19-10-12-20(13-11-19)18-27-17-16-23-22-8-4-5-9-24(22)28-26(23)21-6-2-1-3-7-21/h1-15,27-28,31H,16-18H2,(H,29,30)/b15-14+
NCI pathway
Reactome pathway
n/an/a 12n/an/an/an/an/an/a
Novartis Institutes for Biomedical Research
Curated by ChEMBL
Assay Description
Inhibition of HDAC1
J Med Chem 54: 4752-72 (2011)
Article DOI: 10.1021/jm200388e
BindingDB Entry DOI: 10.7270/Q23N24DW