null
SMILES: Cc1ccc(NC(=O)NC2CCCCCCC2)cc1Cl
InChI Key: InChIKey=DHZVTSNKLYUMMR-UHFFFAOYSA-N
Activity Spreadsheet -- Enzyme Inhibition Constant Data from BindingDB
Found 1 hit for monomerid = 50351226
Trg + Lig
Ki
nM
ΔG°
kcal/mole
IC50
nM
Kd
nM
EC50/IC50
nM
koff
s-1
kon
M-1s-1
pHTemp
°C
Bifunctional epoxide hydrolase 2
(Homo sapiens (Human))
BDBM50351226
(CHEMBL1818404)
Show SMILES Cc1ccc(NC(=O)NC2CCCCCCC2)cc1Cl
Show InChI InChI=1S/C16H23ClN2O/c1-12-9-10-14(11-15(12)17)19-16(20)18-13-7-5-3-2-4-6-8-13/h9-11,13H,2-8H2,1H3,(H2,18,19,20)
n/an/a 0.400n/an/an/an/an/an/a
St. Jude Children's Research Hospital
Curated by ChEMBL
Assay Description
Inhibition of human recombinant soluble epoxide hydrolase using CMNPC as substrate after 10 mins by fluorescent assay
Bioorg Med Chem 19: 5585-95 (2011)
Article DOI: 10.1016/j.bmc.2011.07.034
BindingDB Entry DOI: 10.7270/Q2V69JZ1