BDBM50351228 CHEMBL1817677
SMILES: Cc1ccc(NC(=O)NCC23CC4CC(CC(C4)C2)C3)cc1Cl
InChI Key: InChIKey=AWKJWRQFXCVSLJ-UHFFFAOYSA-N
Data: 1 IC50
Activity Spreadsheet -- Enzyme Inhibition Constant Data from BindingDB
Found 1 hit for monomerid = 50351228
Trg + Lig
Ki
nM
ΔG°
kcal/mole
IC50
nM
Kd
nM
EC50/IC50
nM
koff
s-1
kon
M-1s-1
pHTemp
°C
Bifunctional epoxide hydrolase 2
(Homo sapiens (Human))
BDBM50351228
(CHEMBL1817677)
Show SMILES Cc1ccc(NC(=O)NCC23CC4CC(CC(C4)C2)C3)cc1Cl |TLB:13:14:11.12.17:18,THB:13:12:18:19.14.15,15:14:11:17.16.18,15:16:11:19.13.14|
Show InChI InChI=1S/C19H25ClN2O/c1-12-2-3-16(7-17(12)20)22-18(23)21-11-19-8-13-4-14(9-19)6-15(5-13)10-19/h2-3,7,13-15H,4-6,8-11H2,1H3,(H2,21,22,23)
n/an/a 0.400n/an/an/an/an/an/a
St. Jude Children's Research Hospital
Curated by ChEMBL
Assay Description
Inhibition of human recombinant soluble epoxide hydrolase using CMNPC as substrate after 10 mins by fluorescent assay
Bioorg Med Chem 19: 5585-95 (2011)
Article DOI: 10.1016/j.bmc.2011.07.034
BindingDB Entry DOI: 10.7270/Q2V69JZ1