BDBM50351252 CHEMBL8755
SMILES: CCCCCCCCCCCC(=O)N[C@H]1CCOC1=O
InChI Key: InChIKey=WILLZMOKUUPJSL-AWEZNQCLSA-N
Data: 1 IC50  3 EC50
PDB links: 1 PDB ID matches this monomer.
Activity Spreadsheet -- Enzyme Inhibition Constant Data from BindingDB
Found 4 hits for monomerid = 50351252
Trg + Lig
Ki
nM
ΔG°
kcal/mole
IC50
nM
Kd
nM
EC50/IC50
nM
koff
s-1
kon
M-1s-1
pHTemp
°C
Transcriptional activator protein lasR
(Pseudomonas aeruginosa)
BDBM50351252
(CHEMBL8755)
Show SMILES CCCCCCCCCCCC(=O)N[C@H]1CCOC1=O
Show InChI InChI=1S/C16H29NO3/c1-2-3-4-5-6-7-8-9-10-11-15(18)17-14-12-13-20-16(14)19/h14H,2-13H2,1H3,(H,17,18)/t14-/m0/s1
n/an/a 40n/an/an/an/an/an/a
Florida International University
Curated by ChEMBL
Assay Description
Inhibition of Pseudomonas aeruginosa LasR
Bioorg Med Chem 19: 5500-6 (2011)
Article DOI: 10.1016/j.bmc.2011.07.044
BindingDB Entry DOI: 10.7270/Q2QF8T7Q
PhzR
(Pseudomonas aeruginosa)
BDBM50351252
(CHEMBL8755)
Show SMILES CCCCCCCCCCCC(=O)N[C@H]1CCOC1=O
Show InChI InChI=1S/C16H29NO3/c1-2-3-4-5-6-7-8-9-10-11-15(18)17-14-12-13-20-16(14)19/h14H,2-13H2,1H3,(H,17,18)/t14-/m0/s1
n/an/an/an/a 5n/an/an/an/a
University of Wisconsin-Madison
Curated by ChEMBL
Assay Description
Agonist activity at Pseudomonas aeruginosa QscR expressed in Escherichia coli assessed as production of beta-galactosidase
Bioorg Med Chem Lett 18: 3072-5 (2008)
Article DOI: 10.1016/j.bmcl.2007.11.095
BindingDB Entry DOI: 10.7270/Q2MS3TM8
3D
3D Structure (crystal)
Transcriptional activator protein lasR
(Pseudomonas aeruginosa)
BDBM50351252
(CHEMBL8755)
Show SMILES CCCCCCCCCCCC(=O)N[C@H]1CCOC1=O
Show InChI InChI=1S/C16H29NO3/c1-2-3-4-5-6-7-8-9-10-11-15(18)17-14-12-13-20-16(14)19/h14H,2-13H2,1H3,(H,17,18)/t14-/m0/s1
n/an/an/an/a 33n/an/an/an/a
The Scripps Research Institute
Curated by ChEMBL
Assay Description
Agonist activity at Pseudomonas aeruginosa LasR cognate receptor expressed in Escherichia coli harboring pKDT17 assessed as activation of lasB expres...
J Med Chem 53: 7467-89 (2010)
Article DOI: 10.1021/jm901742e
BindingDB Entry DOI: 10.7270/Q2S75GPT
Transcriptional activator protein lasR
(Pseudomonas aeruginosa)
BDBM50351252
(CHEMBL8755)
Show SMILES CCCCCCCCCCCC(=O)N[C@H]1CCOC1=O
Show InChI InChI=1S/C16H29NO3/c1-2-3-4-5-6-7-8-9-10-11-15(18)17-14-12-13-20-16(14)19/h14H,2-13H2,1H3,(H,17,18)/t14-/m0/s1
n/an/an/an/a 40n/an/an/an/a
The Scripps Research Institute
Curated by ChEMBL
Assay Description
Agonist activity at Pseudomonas aeruginosa LasR receptor expressed in Escherichia coli in absence of natural autoinducer
J Med Chem 53: 7467-89 (2010)
Article DOI: 10.1021/jm901742e
BindingDB Entry DOI: 10.7270/Q2S75GPT