BDBM50351493 CHEMBL1819618
SMILES: COc1ccc(NC(=O)c2ccc(OC[C@@H]3CN(C)c4ccccc4O3)cc2C)cc1CC(O)=O
InChI Key: InChIKey=NAGFMRPTNOHLQL-NRFANRHFSA-N
Data: 1 KI  1 IC50
Activity Spreadsheet -- Enzyme Inhibition Constant Data from BindingDB
Found 2 hits for monomerid = 50351493
Trg + Lig
Ki
nM
ΔG°
kcal/mole
IC50
nM
Kd
nM
EC50/IC50
nM
koff
s-1
kon
M-1s-1
pHTemp
°C
Prostanoid DP receptor
(Mus musculus)
BDBM50351493
(CHEMBL1819618)
Show SMILES COc1ccc(NC(=O)c2ccc(OC[C@@H]3CN(C)c4ccccc4O3)cc2C)cc1CC(O)=O |r|
Show InChI InChI=1S/C27H28N2O6/c1-17-12-20(34-16-21-15-29(2)23-6-4-5-7-25(23)35-21)9-10-22(17)27(32)28-19-8-11-24(33-3)18(13-19)14-26(30)31/h4-13,21H,14-16H2,1-3H3,(H,28,32)(H,30,31)/t21-/m0/s1
Reactome pathway
24n/an/an/an/an/an/an/an/a
Minase Research Institute
Curated by ChEMBL
Assay Description
Displacement of [3H]PGD2 from mouse prostanoid DP receptor expressed in CHO cells after 60 mins by liquid scintillation counting
Bioorg Med Chem 19: 5361-71 (2011)
Article DOI: 10.1016/j.bmc.2011.08.007
BindingDB Entry DOI: 10.7270/Q2X067DJ
Prostanoid DP receptor
(Mus musculus)
BDBM50351493
(CHEMBL1819618)
Show SMILES COc1ccc(NC(=O)c2ccc(OC[C@@H]3CN(C)c4ccccc4O3)cc2C)cc1CC(O)=O |r|
Show InChI InChI=1S/C27H28N2O6/c1-17-12-20(34-16-21-15-29(2)23-6-4-5-7-25(23)35-21)9-10-22(17)27(32)28-19-8-11-24(33-3)18(13-19)14-26(30)31/h4-13,21H,14-16H2,1-3H3,(H,28,32)(H,30,31)/t21-/m0/s1
Reactome pathway
n/an/a 20n/an/an/an/an/an/a
Minase Research Institute
Curated by ChEMBL
Assay Description
Antagonist activity at mouse prostanoid DP receptor expressed in CHO cells assessed as inhibition of PGD2-induced intracellular cAMP production
Bioorg Med Chem 19: 5361-71 (2011)
Article DOI: 10.1016/j.bmc.2011.08.007
BindingDB Entry DOI: 10.7270/Q2X067DJ