BDBM50351504 CHEMBL1823937
SMILES: BrCC(=O)NCCCCCCCCCC(=O)CC(=O)N[C@H]1CCOC1=O
InChI Key: InChIKey=PUZLPYAMDWEIDF-HNNXBMFYSA-N
Data: 1 IC50
Activity Spreadsheet -- Enzyme Inhibition Constant Data from BindingDB
Found 1 hit for monomerid = 50351504
Trg + Lig
Ki
nM
ΔG°
kcal/mole
IC50
nM
Kd
nM
EC50/IC50
nM
koff
s-1
kon
M-1s-1
pHTemp
°C
Transcriptional activator protein lasR
(Pseudomonas aeruginosa)
BDBM50351504
(CHEMBL1823937)
Show SMILES BrCC(=O)NCCCCCCCCCC(=O)CC(=O)N[C@H]1CCOC1=O |r|
Show InChI InChI=1S/C18H29BrN2O5/c19-13-17(24)20-10-7-5-3-1-2-4-6-8-14(22)12-16(23)21-15-9-11-26-18(15)25/h15H,1-13H2,(H,20,24)(H,21,23)/t15-/m0/s1
n/an/a 1.00E+5n/an/an/an/an/an/a
The Scripps Research Institute
Curated by ChEMBL
Assay Description
Antagonist activity at Pseudomonas aeruginosa LasR receptor assessed as inhibition of bioluminescence by reporter gene assay
J Med Chem 53: 7467-89 (2010)
Article DOI: 10.1021/jm901742e
BindingDB Entry DOI: 10.7270/Q2S75GPT