BDBM50351512 CHEMBL8483
SMILES: CCCCCCCCCC(=O)CC(=O)N[C@H]1CCOC1=O
InChI Key: InChIKey=PHSRRHGYXQCRPU-AWEZNQCLSA-N
Data: 1 IC50  6 EC50
PDB links: 7 PDB IDs match this monomer.
Activity Spreadsheet -- Enzyme Inhibition Constant Data from BindingDB
Found 7 hits for monomerid = 50351512
Trg + Lig
Ki
nM
ΔG°
kcal/mole
IC50
nM
Kd
nM
EC50/IC50
nM
koff
s-1
kon
M-1s-1
pHTemp
°C
Transcriptional activator protein lasR
(Pseudomonas aeruginosa)
BDBM50351512
(CHEMBL8483)
Show SMILES CCCCCCCCCC(=O)CC(=O)N[C@H]1CCOC1=O |r|
Show InChI InChI=1S/C16H27NO4/c1-2-3-4-5-6-7-8-9-13(18)12-15(19)17-14-10-11-21-16(14)20/h14H,2-12H2,1H3,(H,17,19)/t14-/m0/s1
n/an/an/an/a 31n/an/an/an/a
Rowan University
Curated by ChEMBL
Assay Description
Agonist activity at Pseudomonas aeruginosa LasR
ACS Med Chem Lett 6: 162-7 (2015)
Article DOI: 10.1021/ml500459f
BindingDB Entry DOI: 10.7270/Q2CV4KF1
3D
3D Structure (crystal)
Transcriptional activator protein lasR
(Pseudomonas aeruginosa)
BDBM50351512
(CHEMBL8483)
Show SMILES CCCCCCCCCC(=O)CC(=O)N[C@H]1CCOC1=O |r|
Show InChI InChI=1S/C16H27NO4/c1-2-3-4-5-6-7-8-9-13(18)12-15(19)17-14-10-11-21-16(14)20/h14H,2-12H2,1H3,(H,17,19)/t14-/m0/s1
n/an/an/an/a 7n/an/an/an/a
The Scripps Research Institute
Curated by ChEMBL
Assay Description
Agonist activity at Pseudomonas aeruginosa LasR cognate receptor expressed in Escherichia coli harboring pKDT17 assessed as activation of lasB expres...
J Med Chem 53: 7467-89 (2010)
Article DOI: 10.1021/jm901742e
BindingDB Entry DOI: 10.7270/Q2S75GPT
3D
3D Structure (crystal)
PhzR
(Pseudomonas aeruginosa)
BDBM50351512
(CHEMBL8483)
Show SMILES CCCCCCCCCC(=O)CC(=O)N[C@H]1CCOC1=O |r|
Show InChI InChI=1S/C16H27NO4/c1-2-3-4-5-6-7-8-9-13(18)12-15(19)17-14-10-11-21-16(14)20/h14H,2-12H2,1H3,(H,17,19)/t14-/m0/s1
n/an/an/an/a 22n/an/an/an/a
University of Wisconsin-Madison
Curated by ChEMBL
Assay Description
Agonist activity at Pseudomonas aeruginosa QscR expressed in Escherichia coli assessed as production of beta-galactosidase
Bioorg Med Chem Lett 18: 3072-5 (2008)
Article DOI: 10.1016/j.bmcl.2007.11.095
BindingDB Entry DOI: 10.7270/Q2MS3TM8
3D
3D Structure (crystal)
Transcriptional activator protein lasR
(Pseudomonas aeruginosa)
BDBM50351512
(CHEMBL8483)
Show SMILES CCCCCCCCCC(=O)CC(=O)N[C@H]1CCOC1=O |r|
Show InChI InChI=1S/C16H27NO4/c1-2-3-4-5-6-7-8-9-13(18)12-15(19)17-14-10-11-21-16(14)20/h14H,2-12H2,1H3,(H,17,19)/t14-/m0/s1
n/an/an/an/a 139n/an/an/an/a
Larkin University
Curated by ChEMBL
Assay Description
Activation of LasR in Pseudomonas aeruginosa PAO-JP2 harboring plasI-LVAgfp incubated for 6 hrs by fluorescence method
Bioorg Med Chem 28: (2020)
Article DOI: 10.1016/j.bmc.2019.115282
3D
3D Structure (crystal)
PhzR
(Pseudomonas aeruginosa)
BDBM50351512
(CHEMBL8483)
Show SMILES CCCCCCCCCC(=O)CC(=O)N[C@H]1CCOC1=O |r|
Show InChI InChI=1S/C16H27NO4/c1-2-3-4-5-6-7-8-9-13(18)12-15(19)17-14-10-11-21-16(14)20/h14H,2-12H2,1H3,(H,17,19)/t14-/m0/s1
n/an/an/an/a 15n/an/an/an/a
University of Wisconsin-Madison
Curated by ChEMBL
Assay Description
Agonist activity at Pseudomonas aeruginosa QscR expressed in Escherichia coli JLD271 harboring QscR expression plasmid pJN105Q and pPA1897-lacZ trans...
Bioorg Med Chem 26: 5336-5342 (2018)
Article DOI: 10.1016/j.bmc.2018.05.018
BindingDB Entry DOI: 10.7270/Q23B62V9
3D
3D Structure (crystal)
Transcriptional activator protein lasR
(Pseudomonas aeruginosa)
BDBM50351512
(CHEMBL8483)
Show SMILES CCCCCCCCCC(=O)CC(=O)N[C@H]1CCOC1=O |r|
Show InChI InChI=1S/C16H27NO4/c1-2-3-4-5-6-7-8-9-13(18)12-15(19)17-14-10-11-21-16(14)20/h14H,2-12H2,1H3,(H,17,19)/t14-/m0/s1
n/an/an/an/a 1.5n/an/an/an/a
University of Wisconsin-Madison
Curated by ChEMBL
Assay Description
Agonist activity at Pseudomonas aeruginosa LasR expressed in Escherichia coli JLD271 harboring LasR expression plasmid pJN105L and lasI-lacZ transcri...
Bioorg Med Chem 26: 5336-5342 (2018)
Article DOI: 10.1016/j.bmc.2018.05.018
BindingDB Entry DOI: 10.7270/Q23B62V9
3D
3D Structure (crystal)
Accessory gene regulator protein A
(Staphylococcus aureus)
BDBM50351512
(CHEMBL8483)
Show SMILES CCCCCCCCCC(=O)CC(=O)N[C@H]1CCOC1=O |r|
Show InChI InChI=1S/C16H27NO4/c1-2-3-4-5-6-7-8-9-13(18)12-15(19)17-14-10-11-21-16(14)20/h14H,2-12H2,1H3,(H,17,19)/t14-/m0/s1
n/an/a 6.00E+3n/an/an/an/an/an/a
University of Nottingham
Curated by ChEMBL
Assay Description
Inhibition of Staphylococcus aureus RN6390B Agr-mediated RNA3 promoter activation measured up to 6 hrs by Northern blot analysis
J Med Chem 56: 1389-404 (2013)
Article DOI: 10.1021/jm3014635
BindingDB Entry DOI: 10.7270/Q2BV7J0M