BDBM50351575 CHEMBL1825015
SMILES: NNC(=O)c1cnc2c(nc(N)[nH]c2=O)n1
InChI Key: InChIKey=GSFGXJOCFRGGGL-UHFFFAOYSA-N
Data: 1 IC50
Activity Spreadsheet -- Enzyme Inhibition Constant Data from BindingDB
Found 1 hit for monomerid = 50351575
Trg + Lig
Ki
nM
ΔG°
kcal/mole
IC50
nM
Kd
nM
EC50/IC50
nM
koff
s-1
kon
M-1s-1
pHTemp
°C
Ricin
(Ricinus communis)
BDBM50351575
(CHEMBL1825015)
Show SMILES NNC(=O)c1cnc2c(nc(N)[nH]c2=O)n1
Show InChI InChI=1S/C7H7N7O2/c8-7-12-4-3(6(16)13-7)10-1-2(11-4)5(15)14-9/h1H,9H2,(H,14,15)(H3,8,11,12,13,16)
n/an/a 5.00E+5n/an/an/an/an/an/a
University of Texas at Austin
Curated by ChEMBL
Assay Description
Inhibition of castor seed ricin A chain translation degradation activity in rabbit reticulocyte lysate after 90 mins by luciferase-based luminometer ...
Eur J Med Chem 46: 3608-15 (2011)
Article DOI: 10.1016/j.ejmech.2011.05.025
BindingDB Entry DOI: 10.7270/Q2D21Z00
3D
3D Structure (docked)