BDBM50351633 CHEMBL497118
SMILES: Cc1csc(c1)-c1ccc2nnc(Cc3ccc(O)cc3)n2n1
InChI Key: InChIKey=QYFIQRSFZFEVOJ-UHFFFAOYSA-N
Data: 1 IC50
Activity Spreadsheet -- Enzyme Inhibition Constant Data from BindingDB
Found 1 hit for monomerid = 50351633
Trg + Lig
Ki
nM
ΔG°
kcal/mole
IC50
nM
Kd
nM
EC50/IC50
nM
koff
s-1
kon
M-1s-1
pHTemp
°C
Hepatocyte growth factor receptor
(Homo sapiens (Human))
BDBM50351633
(CHEMBL497118)
Show SMILES Cc1csc(c1)-c1ccc2nnc(Cc3ccc(O)cc3)n2n1
Show InChI InChI=1S/C17H14N4OS/c1-11-8-15(23-10-11)14-6-7-16-18-19-17(21(16)20-14)9-12-2-4-13(22)5-3-12/h2-8,10,22H,9H2,1H3
n/an/a 1n/an/an/an/an/an/a
Sichuan University
Curated by ChEMBL
Assay Description
Inhibition of human c-MET
Eur J Med Chem 46: 3675-80 (2011)
Article DOI: 10.1016/j.ejmech.2011.05.031
BindingDB Entry DOI: 10.7270/Q2891676