BDBM50351783 CHEMBL1823957
SMILES: OC(=O)C(Cc1ccc2cc(OCc3ccccc3F)ccc2c1)NC(=O)\C=C\c1ccccc1Br
InChI Key: InChIKey=ZUMLKTASSKFUKL-WYMLVPIESA-N
Data: 4 IC50
Activity Spreadsheet -- Enzyme Inhibition Constant Data from BindingDB
Found 4 hits for monomerid = 50351783
Trg + Lig
Ki
nM
ΔG°
kcal/mole
IC50
nM
Kd
nM
EC50/IC50
nM
koff
s-1
kon
M-1s-1
pHTemp
°C
Protein-tyrosine phosphatase 1C
(Homo sapiens (Human))
BDBM50351783
(CHEMBL1823957)
Show SMILES OC(=O)C(Cc1ccc2cc(OCc3ccccc3F)ccc2c1)NC(=O)\C=C\c1ccccc1Br
Show InChI InChI=1S/C29H23BrFNO4/c30-25-7-3-1-5-20(25)12-14-28(33)32-27(29(34)35)16-19-9-10-22-17-24(13-11-21(22)15-19)36-18-23-6-2-4-8-26(23)31/h1-15,17,27H,16,18H2,(H,32,33)(H,34,35)/b14-12+
Reactome pathway
n/an/a 1.10E+4n/an/an/an/a8.0n/a
Yanbian University
Curated by ChEMBL
Assay Description
Inhibition of human recombinant SHP1 in Tris buffer at pH 8 using OMPF as substrate
Eur J Med Chem 46: 3630-8 (2011)
Article DOI: 10.1016/j.ejmech.2011.05.027
BindingDB Entry DOI: 10.7270/Q2W09685
Dual specificity phosphatase Cdc25B
(Homo sapiens (Human))
BDBM50351783
(CHEMBL1823957)
Show SMILES OC(=O)C(Cc1ccc2cc(OCc3ccccc3F)ccc2c1)NC(=O)\C=C\c1ccccc1Br
Show InChI InChI=1S/C29H23BrFNO4/c30-25-7-3-1-5-20(25)12-14-28(33)32-27(29(34)35)16-19-9-10-22-17-24(13-11-21(22)15-19)36-18-23-6-2-4-8-26(23)31/h1-15,17,27H,16,18H2,(H,32,33)(H,34,35)/b14-12+
Reactome pathway
n/an/a 2.89E+3n/an/an/an/an/an/a
Yanbian University
Curated by ChEMBL
Assay Description
Inhibition of human recombinant CDC25B
Eur J Med Chem 46: 3630-8 (2011)
Article DOI: 10.1016/j.ejmech.2011.05.027
BindingDB Entry DOI: 10.7270/Q2W09685
Tyrosine-protein phosphatase non-receptor type 2
(Homo sapiens (Human))
BDBM50351783
(CHEMBL1823957)
Show SMILES OC(=O)C(Cc1ccc2cc(OCc3ccccc3F)ccc2c1)NC(=O)\C=C\c1ccccc1Br
Show InChI InChI=1S/C29H23BrFNO4/c30-25-7-3-1-5-20(25)12-14-28(33)32-27(29(34)35)16-19-9-10-22-17-24(13-11-21(22)15-19)36-18-23-6-2-4-8-26(23)31/h1-15,17,27H,16,18H2,(H,32,33)(H,34,35)/b14-12+
n/an/a 4.66E+3n/an/an/an/an/an/a
Yanbian University
Curated by ChEMBL
Assay Description
Inhibition of TCPTP
Eur J Med Chem 46: 3630-8 (2011)
Article DOI: 10.1016/j.ejmech.2011.05.027
BindingDB Entry DOI: 10.7270/Q2W09685
Protein-tyrosine phosphatase 1B
(Homo sapiens (Human))
BDBM50351783
(CHEMBL1823957)
Show SMILES OC(=O)C(Cc1ccc2cc(OCc3ccccc3F)ccc2c1)NC(=O)\C=C\c1ccccc1Br
Show InChI InChI=1S/C29H23BrFNO4/c30-25-7-3-1-5-20(25)12-14-28(33)32-27(29(34)35)16-19-9-10-22-17-24(13-11-21(22)15-19)36-18-23-6-2-4-8-26(23)31/h1-15,17,27H,16,18H2,(H,32,33)(H,34,35)/b14-12+
NCI pathway
Reactome pathway
n/an/a 1.77E+3n/an/an/an/an/an/a
Yanbian University
Curated by ChEMBL
Assay Description
Inhibition of PTP1B using p-nitrophenyl phosphate as substrate
Eur J Med Chem 46: 3630-8 (2011)
Article DOI: 10.1016/j.ejmech.2011.05.027
BindingDB Entry DOI: 10.7270/Q2W09685