BDBM50352099 CHEMBL1824231
SMILES: CN(C)[C@H]1CC[C@@H](CC1)c1ccc(OCCCN2CCCCC2)cc1
InChI Key: InChIKey=NBCFVKKQKAXINS-XUTJKUGGSA-N
Data: 2 KI  3 IC50
Activity Spreadsheet -- Enzyme Inhibition Constant Data from BindingDB
Found 5 hits for monomerid = 50352099
Trg + Lig
Ki
nM
ΔG°
kcal/mole
IC50
nM
Kd
nM
EC50/IC50
nM
koff
s-1
kon
M-1s-1
pHTemp
°C
Histamine H3 receptor
(Homo sapiens (Human))
BDBM50352099
(CHEMBL1824231)
Show SMILES CN(C)[C@H]1CC[C@@H](CC1)c1ccc(OCCCN2CCCCC2)cc1 |r,wU:3.2,wD:6.9,(46.41,2.61,;45.65,3.95,;46.43,5.28,;44.11,3.96,;43.33,2.64,;41.79,2.65,;41.03,3.99,;41.8,5.32,;43.35,5.3,;39.49,4,;38.71,2.68,;37.18,2.68,;36.41,4.02,;34.87,4.03,;34.1,2.69,;32.56,2.7,;31.79,4.03,;30.25,4.03,;29.49,2.71,;27.95,2.71,;27.17,4.03,;27.95,5.37,;29.49,5.37,;37.18,5.35,;38.72,5.34,)|
Show InChI InChI=1S/C22H36N2O/c1-23(2)21-11-7-19(8-12-21)20-9-13-22(14-10-20)25-18-6-17-24-15-4-3-5-16-24/h9-10,13-14,19,21H,3-8,11-12,15-18H2,1-2H3/t19-,21-
Reactome pathway
0.210n/an/an/an/an/an/an/an/a
Bioprojet-Biotech
Curated by ChEMBL
Assay Description
Displacement of [125I]Iodoproxyfan from recombinant human histamine H3 receptor expressed in HEK293 cells after 60 mins
Bioorg Med Chem Lett 21: 5384-8 (2011)
Article DOI: 10.1016/j.bmcl.2011.06.102
BindingDB Entry DOI: 10.7270/Q2DV1K7H
Histamine H3 receptor
(Mus musculus)
BDBM50352099
(CHEMBL1824231)
Show SMILES CN(C)[C@H]1CC[C@@H](CC1)c1ccc(OCCCN2CCCCC2)cc1 |r,wU:3.2,wD:6.9,(46.41,2.61,;45.65,3.95,;46.43,5.28,;44.11,3.96,;43.33,2.64,;41.79,2.65,;41.03,3.99,;41.8,5.32,;43.35,5.3,;39.49,4,;38.71,2.68,;37.18,2.68,;36.41,4.02,;34.87,4.03,;34.1,2.69,;32.56,2.7,;31.79,4.03,;30.25,4.03,;29.49,2.71,;27.95,2.71,;27.17,4.03,;27.95,5.37,;29.49,5.37,;37.18,5.35,;38.72,5.34,)|
Show InChI InChI=1S/C22H36N2O/c1-23(2)21-11-7-19(8-12-21)20-9-13-22(14-10-20)25-18-6-17-24-15-4-3-5-16-24/h9-10,13-14,19,21H,3-8,11-12,15-18H2,1-2H3/t19-,21-
Reactome pathway
0.520n/an/an/an/an/an/an/an/a
Bioprojet-Biotech
Curated by ChEMBL
Assay Description
Displacement of [125I]Iodoproxyfan from mouse brain cortex histamine H3 receptor after 60 mins
Bioorg Med Chem Lett 21: 5384-8 (2011)
Article DOI: 10.1016/j.bmcl.2011.06.102
BindingDB Entry DOI: 10.7270/Q2DV1K7H
Cytochrome P450 3A4
(Homo sapiens (Human))
BDBM50352099
(CHEMBL1824231)
Show SMILES CN(C)[C@H]1CC[C@@H](CC1)c1ccc(OCCCN2CCCCC2)cc1 |r,wU:3.2,wD:6.9,(46.41,2.61,;45.65,3.95,;46.43,5.28,;44.11,3.96,;43.33,2.64,;41.79,2.65,;41.03,3.99,;41.8,5.32,;43.35,5.3,;39.49,4,;38.71,2.68,;37.18,2.68,;36.41,4.02,;34.87,4.03,;34.1,2.69,;32.56,2.7,;31.79,4.03,;30.25,4.03,;29.49,2.71,;27.95,2.71,;27.17,4.03,;27.95,5.37,;29.49,5.37,;37.18,5.35,;38.72,5.34,)|
Show InChI InChI=1S/C22H36N2O/c1-23(2)21-11-7-19(8-12-21)20-9-13-22(14-10-20)25-18-6-17-24-15-4-3-5-16-24/h9-10,13-14,19,21H,3-8,11-12,15-18H2,1-2H3/t19-,21-
Reactome pathway
n/an/a 4.26E+4n/an/an/an/an/an/a
Bioprojet-Biotech
Curated by ChEMBL
Assay Description
Inhibition of CYP3A4
Bioorg Med Chem Lett 21: 5384-8 (2011)
Article DOI: 10.1016/j.bmcl.2011.06.102
BindingDB Entry DOI: 10.7270/Q2DV1K7H
Cytochrome P450 2C9
(Homo sapiens (Human))
BDBM50352099
(CHEMBL1824231)
Show SMILES CN(C)[C@H]1CC[C@@H](CC1)c1ccc(OCCCN2CCCCC2)cc1 |r,wU:3.2,wD:6.9,(46.41,2.61,;45.65,3.95,;46.43,5.28,;44.11,3.96,;43.33,2.64,;41.79,2.65,;41.03,3.99,;41.8,5.32,;43.35,5.3,;39.49,4,;38.71,2.68,;37.18,2.68,;36.41,4.02,;34.87,4.03,;34.1,2.69,;32.56,2.7,;31.79,4.03,;30.25,4.03,;29.49,2.71,;27.95,2.71,;27.17,4.03,;27.95,5.37,;29.49,5.37,;37.18,5.35,;38.72,5.34,)|
Show InChI InChI=1S/C22H36N2O/c1-23(2)21-11-7-19(8-12-21)20-9-13-22(14-10-20)25-18-6-17-24-15-4-3-5-16-24/h9-10,13-14,19,21H,3-8,11-12,15-18H2,1-2H3/t19-,21-
Reactome pathway
n/an/a 4.07E+4n/an/an/an/an/an/a
Bioprojet-Biotech
Curated by ChEMBL
Assay Description
Inhibition of CYP2C9
Bioorg Med Chem Lett 21: 5384-8 (2011)
Article DOI: 10.1016/j.bmcl.2011.06.102
BindingDB Entry DOI: 10.7270/Q2DV1K7H
Cytochrome P450 2D6
(Homo sapiens (Human))
BDBM50352099
(CHEMBL1824231)
Show SMILES CN(C)[C@H]1CC[C@@H](CC1)c1ccc(OCCCN2CCCCC2)cc1 |r,wU:3.2,wD:6.9,(46.41,2.61,;45.65,3.95,;46.43,5.28,;44.11,3.96,;43.33,2.64,;41.79,2.65,;41.03,3.99,;41.8,5.32,;43.35,5.3,;39.49,4,;38.71,2.68,;37.18,2.68,;36.41,4.02,;34.87,4.03,;34.1,2.69,;32.56,2.7,;31.79,4.03,;30.25,4.03,;29.49,2.71,;27.95,2.71,;27.17,4.03,;27.95,5.37,;29.49,5.37,;37.18,5.35,;38.72,5.34,)|
Show InChI InChI=1S/C22H36N2O/c1-23(2)21-11-7-19(8-12-21)20-9-13-22(14-10-20)25-18-6-17-24-15-4-3-5-16-24/h9-10,13-14,19,21H,3-8,11-12,15-18H2,1-2H3/t19-,21-
n/an/a>1.00E+5n/an/an/an/an/an/a
Bioprojet-Biotech
Curated by ChEMBL
Assay Description
Inhibition of CYP2D6
Bioorg Med Chem Lett 21: 5384-8 (2011)
Article DOI: 10.1016/j.bmcl.2011.06.102
BindingDB Entry DOI: 10.7270/Q2DV1K7H