null
SMILES: C[C@@H](O)[C@@H]1NC(=O)[C@H](CCCCN)NC(=O)[C@H](Cc2c[nH]c3ccccc23)NC(=O)[C@H](Cc2ccccc2)NC(=O)[C@H](Cc2ccccc2)NC(=O)[C@@H](N)CSSC[C@H](NC(=O)[C@H](Cc2ccccc2)NC1=O)C(O)=O
InChI Key: InChIKey=PJRZZHKHLDKTKL-VJLATZRLSA-N
Activity Spreadsheet -- Enzyme Inhibition Constant Data from BindingDB
Found 6 hits for monomerid = 50352482
Trg + Lig
Ki
nM
ΔG°
kcal/mole
IC50
nM
Kd
nM
EC50/IC50
nM
koff
s-1
kon
M-1s-1
pHTemp
°C
Somatostatin receptor type 4
(Homo sapiens (Human))
BDBM50352482
(CHEMBL1824055)
Show SMILES C[C@@H](O)[C@@H]1NC(=O)[C@H](CCCCN)NC(=O)[C@H](Cc2c[nH]c3ccccc23)NC(=O)[C@H](Cc2ccccc2)NC(=O)[C@H](Cc2ccccc2)NC(=O)[C@@H](N)CSSC[C@H](NC(=O)[C@H](Cc2ccccc2)NC1=O)C(O)=O |r|
Show InChI InChI=1S/C54H66N10O10S2/c1-32(65)46-53(72)62-43(27-35-19-9-4-10-20-35)51(70)63-45(54(73)74)31-76-75-30-38(56)47(66)59-41(25-33-15-5-2-6-16-33)49(68)60-42(26-34-17-7-3-8-18-34)50(69)61-44(28-36-29-57-39-22-12-11-21-37(36)39)52(71)58-40(48(67)64-46)23-13-14-24-55/h2-12,15-22,29,32,38,40-46,57,65H,13-14,23-28,30-31,55-56H2,1H3,(H,58,71)(H,59,66)(H,60,68)(H,61,69)(H,62,72)(H,63,70)(H,64,67)(H,73,74)/t32-,38+,40+,41+,42+,43+,44+,45+,46+/m1/s1
n/an/a 0.700n/an/an/an/an/an/a
Salk Institute
Curated by ChEMBL
Assay Description
Displacement of 125I-[LTT]-SRIF-28 from human sst4 receptor in CCL39 cells after 2 hrs by autoradiography
J Med Chem 54: 5981-7 (2011)
Article DOI: 10.1021/jm200307v
BindingDB Entry DOI: 10.7270/Q2BV7H1N
Somatostatin receptor type 1
(Homo sapiens (Human))
BDBM50352482
(CHEMBL1824055)
Show SMILES C[C@@H](O)[C@@H]1NC(=O)[C@H](CCCCN)NC(=O)[C@H](Cc2c[nH]c3ccccc23)NC(=O)[C@H](Cc2ccccc2)NC(=O)[C@H](Cc2ccccc2)NC(=O)[C@@H](N)CSSC[C@H](NC(=O)[C@H](Cc2ccccc2)NC1=O)C(O)=O |r|
Show InChI InChI=1S/C54H66N10O10S2/c1-32(65)46-53(72)62-43(27-35-19-9-4-10-20-35)51(70)63-45(54(73)74)31-76-75-30-38(56)47(66)59-41(25-33-15-5-2-6-16-33)49(68)60-42(26-34-17-7-3-8-18-34)50(69)61-44(28-36-29-57-39-22-12-11-21-37(36)39)52(71)58-40(48(67)64-46)23-13-14-24-55/h2-12,15-22,29,32,38,40-46,57,65H,13-14,23-28,30-31,55-56H2,1H3,(H,58,71)(H,59,66)(H,60,68)(H,61,69)(H,62,72)(H,63,70)(H,64,67)(H,73,74)/t32-,38+,40+,41+,42+,43+,44+,45+,46+/m1/s1
n/an/a 5.30n/an/an/an/an/an/a
Salk Institute
Curated by ChEMBL
Assay Description
Displacement of 125I-[LTT]-SRIF-28 from human sst1 receptor in CHO cells after 2 hrs by autoradiography
J Med Chem 54: 5981-7 (2011)
Article DOI: 10.1021/jm200307v
BindingDB Entry DOI: 10.7270/Q2BV7H1N
Somatostatin receptor type 3
(Homo sapiens (Human))
BDBM50352482
(CHEMBL1824055)
Show SMILES C[C@@H](O)[C@@H]1NC(=O)[C@H](CCCCN)NC(=O)[C@H](Cc2c[nH]c3ccccc23)NC(=O)[C@H](Cc2ccccc2)NC(=O)[C@H](Cc2ccccc2)NC(=O)[C@@H](N)CSSC[C@H](NC(=O)[C@H](Cc2ccccc2)NC1=O)C(O)=O |r|
Show InChI InChI=1S/C54H66N10O10S2/c1-32(65)46-53(72)62-43(27-35-19-9-4-10-20-35)51(70)63-45(54(73)74)31-76-75-30-38(56)47(66)59-41(25-33-15-5-2-6-16-33)49(68)60-42(26-34-17-7-3-8-18-34)50(69)61-44(28-36-29-57-39-22-12-11-21-37(36)39)52(71)58-40(48(67)64-46)23-13-14-24-55/h2-12,15-22,29,32,38,40-46,57,65H,13-14,23-28,30-31,55-56H2,1H3,(H,58,71)(H,59,66)(H,60,68)(H,61,69)(H,62,72)(H,63,70)(H,64,67)(H,73,74)/t32-,38+,40+,41+,42+,43+,44+,45+,46+/m1/s1
Reactome pathway
n/an/a 13n/an/an/an/an/an/a
Salk Institute
Curated by ChEMBL
Assay Description
Displacement of 125I-[LTT]-SRIF-28 from human sst3 receptor in CCL39 cells after 2 hrs by autoradiography
J Med Chem 54: 5981-7 (2011)
Article DOI: 10.1021/jm200307v
BindingDB Entry DOI: 10.7270/Q2BV7H1N
Somatostatin receptor type 5
(Homo sapiens (Human))
BDBM50352482
(CHEMBL1824055)
Show SMILES C[C@@H](O)[C@@H]1NC(=O)[C@H](CCCCN)NC(=O)[C@H](Cc2c[nH]c3ccccc23)NC(=O)[C@H](Cc2ccccc2)NC(=O)[C@H](Cc2ccccc2)NC(=O)[C@@H](N)CSSC[C@H](NC(=O)[C@H](Cc2ccccc2)NC1=O)C(O)=O |r|
Show InChI InChI=1S/C54H66N10O10S2/c1-32(65)46-53(72)62-43(27-35-19-9-4-10-20-35)51(70)63-45(54(73)74)31-76-75-30-38(56)47(66)59-41(25-33-15-5-2-6-16-33)49(68)60-42(26-34-17-7-3-8-18-34)50(69)61-44(28-36-29-57-39-22-12-11-21-37(36)39)52(71)58-40(48(67)64-46)23-13-14-24-55/h2-12,15-22,29,32,38,40-46,57,65H,13-14,23-28,30-31,55-56H2,1H3,(H,58,71)(H,59,66)(H,60,68)(H,61,69)(H,62,72)(H,63,70)(H,64,67)(H,73,74)/t32-,38+,40+,41+,42+,43+,44+,45+,46+/m1/s1
Reactome pathway
n/an/a 16n/an/an/an/an/an/a
Salk Institute
Curated by ChEMBL
Assay Description
Displacement of 125I-[LTT]-SRIF-28 from human sst5 receptor in HEK293 cells after 2 hrs by autoradiography
J Med Chem 54: 5981-7 (2011)
Article DOI: 10.1021/jm200307v
BindingDB Entry DOI: 10.7270/Q2BV7H1N
Somatostatin receptor type 2
(Homo sapiens (Human))
BDBM50352482
(CHEMBL1824055)
Show SMILES C[C@@H](O)[C@@H]1NC(=O)[C@H](CCCCN)NC(=O)[C@H](Cc2c[nH]c3ccccc23)NC(=O)[C@H](Cc2ccccc2)NC(=O)[C@H](Cc2ccccc2)NC(=O)[C@@H](N)CSSC[C@H](NC(=O)[C@H](Cc2ccccc2)NC1=O)C(O)=O |r|
Show InChI InChI=1S/C54H66N10O10S2/c1-32(65)46-53(72)62-43(27-35-19-9-4-10-20-35)51(70)63-45(54(73)74)31-76-75-30-38(56)47(66)59-41(25-33-15-5-2-6-16-33)49(68)60-42(26-34-17-7-3-8-18-34)50(69)61-44(28-36-29-57-39-22-12-11-21-37(36)39)52(71)58-40(48(67)64-46)23-13-14-24-55/h2-12,15-22,29,32,38,40-46,57,65H,13-14,23-28,30-31,55-56H2,1H3,(H,58,71)(H,59,66)(H,60,68)(H,61,69)(H,62,72)(H,63,70)(H,64,67)(H,73,74)/t32-,38+,40+,41+,42+,43+,44+,45+,46+/m1/s1
n/an/a 130n/an/an/an/an/an/a
Salk Institute
Curated by ChEMBL
Assay Description
Displacement of 125I-[LTT]-SRIF-28 from human sst2 receptor in CCL39 cells after 2 hrs by autoradiography
J Med Chem 54: 5981-7 (2011)
Article DOI: 10.1021/jm200307v
BindingDB Entry DOI: 10.7270/Q2BV7H1N
Somatostatin receptor type 3
(Homo sapiens (Human))
BDBM50352482
(CHEMBL1824055)
Show SMILES C[C@@H](O)[C@@H]1NC(=O)[C@H](CCCCN)NC(=O)[C@H](Cc2c[nH]c3ccccc23)NC(=O)[C@H](Cc2ccccc2)NC(=O)[C@H](Cc2ccccc2)NC(=O)[C@@H](N)CSSC[C@H](NC(=O)[C@H](Cc2ccccc2)NC1=O)C(O)=O |r|
Show InChI InChI=1S/C54H66N10O10S2/c1-32(65)46-53(72)62-43(27-35-19-9-4-10-20-35)51(70)63-45(54(73)74)31-76-75-30-38(56)47(66)59-41(25-33-15-5-2-6-16-33)49(68)60-42(26-34-17-7-3-8-18-34)50(69)61-44(28-36-29-57-39-22-12-11-21-37(36)39)52(71)58-40(48(67)64-46)23-13-14-24-55/h2-12,15-22,29,32,38,40-46,57,65H,13-14,23-28,30-31,55-56H2,1H3,(H,58,71)(H,59,66)(H,60,68)(H,61,69)(H,62,72)(H,63,70)(H,64,67)(H,73,74)/t32-,38+,40+,41+,42+,43+,44+,45+,46+/m1/s1
Reactome pathway
n/an/an/an/a 4.70n/an/an/an/a
Salk Institute
Curated by ChEMBL
Assay Description
Partial agonist activity at human sst3 receptor expressed in CCL39 cells after 5 hrs by luciferase reporter gene assay
J Med Chem 54: 5981-7 (2011)
Article DOI: 10.1021/jm200307v
BindingDB Entry DOI: 10.7270/Q2BV7H1N