null
SMILES: CC(Oc1cc(cnc1N)-c1cc[nH]n1)c1c(Cl)ccc(F)c1Cl
InChI Key: InChIKey=DROZDYQMLMYEQK-UHFFFAOYSA-N
Activity Spreadsheet -- Enzyme Inhibition Constant Data from BindingDB
Found 2 hits for monomerid = 50352547
Trg + Lig
Ki
nM
ΔG°
kcal/mole
IC50
nM
Kd
nM
EC50/IC50
nM
koff
s-1
kon
M-1s-1
pHTemp
°C
Hepatocyte growth factor receptor
(Homo sapiens (Human))
BDBM50352547
(CHEMBL1824891)
Show SMILES CC(Oc1cc(cnc1N)-c1cc[nH]n1)c1c(Cl)ccc(F)c1Cl
Show InChI InChI=1S/C16H13Cl2FN4O/c1-8(14-10(17)2-3-11(19)15(14)18)24-13-6-9(7-21-16(13)20)12-4-5-22-23-12/h2-8H,1H3,(H2,20,21)(H,22,23)
n/an/a 597n/an/an/an/an/an/a
Pfizer Inc.
Curated by ChEMBL
Assay Description
Inhibition of human recombinant c-MET kinase expressed in A549 cells assessed as inhibition of HGF-induced autophosphorylation by ELISA method
J Med Chem 54: 6342-63 (2011)
Article DOI: 10.1021/jm2007613
BindingDB Entry DOI: 10.7270/Q2Q52Q09
Hepatocyte growth factor receptor
(Homo sapiens (Human))
BDBM50352547
(CHEMBL1824891)
Show SMILES CC(Oc1cc(cnc1N)-c1cc[nH]n1)c1c(Cl)ccc(F)c1Cl
Show InChI InChI=1S/C16H13Cl2FN4O/c1-8(14-10(17)2-3-11(19)15(14)18)24-13-6-9(7-21-16(13)20)12-4-5-22-23-12/h2-8H,1H3,(H2,20,21)(H,22,23)
348n/an/an/an/an/an/an/an/a
Pfizer Inc.
Curated by ChEMBL
Assay Description
Binding affinity to human recombinant c-MET assessed as inhibition of autophosphorylation by continuous fluorometric assay
J Med Chem 54: 6342-63 (2011)
Article DOI: 10.1021/jm2007613
BindingDB Entry DOI: 10.7270/Q2Q52Q09