BDBM50352628 CHEMBL1822309::US9796706, Compound 136
SMILES: FC(F)(F)c1ccc2n(CC(=O)Nc3scc(C#N)c3-c3cscn3)c(=O)ccc2c1
InChI Key: InChIKey=IRABIGXKJCMNIG-UHFFFAOYSA-N
Data: 6 IC50
Activity Spreadsheet -- Enzyme Inhibition Constant Data from BindingDB
Found 6 hits for monomerid = 50352628
Trg + Lig
Ki
nM
ΔG°
kcal/mole
IC50
nM
Kd
nM
EC50/IC50
nM
koff
s-1
kon
M-1s-1
pHTemp
°C
Mitogen-activated protein kinase 10
(Homo sapiens (Human))
BDBM50352628
(CHEMBL1822309 | US9796706, Compound 136)
Show SMILES FC(F)(F)c1ccc2n(CC(=O)Nc3scc(C#N)c3-c3cscn3)c(=O)ccc2c1
Show InChI InChI=1S/C20H11F3N4O2S2/c21-20(22,23)13-2-3-15-11(5-13)1-4-17(29)27(15)7-16(28)26-19-18(12(6-24)8-31-19)14-9-30-10-25-14/h1-5,8-10H,7H2,(H,26,28)
NCI pathway
Reactome pathway
n/an/a 8n/an/an/an/an/an/a
Elan Pharmaceuticals
Curated by ChEMBL
Assay Description
Inhibition of recombinant JNK3 using ser73 of c-jun as substrate preincubated for 15 mins measured after 60 mins by TR-FRET assay
Bioorg Med Chem Lett 21: 5521-7 (2011)
Article DOI: 10.1016/j.bmcl.2011.06.100
BindingDB Entry DOI: 10.7270/Q29Z959K
Mitogen-activated protein kinase 8
(Homo sapiens (Human))
BDBM50352628
(CHEMBL1822309 | US9796706, Compound 136)
Show SMILES FC(F)(F)c1ccc2n(CC(=O)Nc3scc(C#N)c3-c3cscn3)c(=O)ccc2c1
Show InChI InChI=1S/C20H11F3N4O2S2/c21-20(22,23)13-2-3-15-11(5-13)1-4-17(29)27(15)7-16(28)26-19-18(12(6-24)8-31-19)14-9-30-10-25-14/h1-5,8-10H,7H2,(H,26,28)
NCI pathway
Reactome pathway
n/an/a 2n/an/an/an/an/an/a
Elan Pharmaceuticals
Curated by ChEMBL
Assay Description
Inhibition of recombinant JNK1 using ser73 of c-jun as substrate preincubated for 15 mins measured after 60 mins by TR-FRET assay
Bioorg Med Chem Lett 21: 5521-7 (2011)
Article DOI: 10.1016/j.bmcl.2011.06.100
BindingDB Entry DOI: 10.7270/Q29Z959K
Mitogen-activated protein kinase 9
(Homo sapiens (Human))
BDBM50352628
(CHEMBL1822309 | US9796706, Compound 136)
Show SMILES FC(F)(F)c1ccc2n(CC(=O)Nc3scc(C#N)c3-c3cscn3)c(=O)ccc2c1
Show InChI InChI=1S/C20H11F3N4O2S2/c21-20(22,23)13-2-3-15-11(5-13)1-4-17(29)27(15)7-16(28)26-19-18(12(6-24)8-31-19)14-9-30-10-25-14/h1-5,8-10H,7H2,(H,26,28)
NCI pathway
Reactome pathway
US Patent
n/an/a<100n/an/an/an/an/an/a
IMAGO PHARMACEUTICALS, INC.
US Patent
Assay Description
(1) Assay buffer #1 with 0.0025% Tween and 1 mM DTT was prepared using JNK buffer stock solution.(2) Assay buffer #2 with 0.025% BSA was prepared usi...
US Patent US9796706 (2017)
BindingDB Entry DOI: 10.7270/Q24T6MHK
Mitogen-activated protein kinase 10
(Homo sapiens (Human))
BDBM50352628
(CHEMBL1822309 | US9796706, Compound 136)
Show SMILES FC(F)(F)c1ccc2n(CC(=O)Nc3scc(C#N)c3-c3cscn3)c(=O)ccc2c1
Show InChI InChI=1S/C20H11F3N4O2S2/c21-20(22,23)13-2-3-15-11(5-13)1-4-17(29)27(15)7-16(28)26-19-18(12(6-24)8-31-19)14-9-30-10-25-14/h1-5,8-10H,7H2,(H,26,28)
NCI pathway
Reactome pathway
US Patent
n/an/a<100n/an/an/an/an/an/a
IMAGO PHARMACEUTICALS, INC.
US Patent
Assay Description
(1) Assay buffer #1 with 0.0025% Tween and 1 mM DTT was prepared using JNK buffer stock solution.(2) Assay buffer #2 with 0.025% BSA was prepared usi...
US Patent US9796706 (2017)
BindingDB Entry DOI: 10.7270/Q24T6MHK
Mitogen-activated protein kinase 8
(Homo sapiens (Human))
BDBM50352628
(CHEMBL1822309 | US9796706, Compound 136)
Show SMILES FC(F)(F)c1ccc2n(CC(=O)Nc3scc(C#N)c3-c3cscn3)c(=O)ccc2c1
Show InChI InChI=1S/C20H11F3N4O2S2/c21-20(22,23)13-2-3-15-11(5-13)1-4-17(29)27(15)7-16(28)26-19-18(12(6-24)8-31-19)14-9-30-10-25-14/h1-5,8-10H,7H2,(H,26,28)
NCI pathway
Reactome pathway
US Patent
n/an/a<100n/an/an/an/an/an/a
IMAGO PHARMACEUTICALS, INC.
US Patent
Assay Description
(1) Assay buffer #1 with 0.0025% Tween and 1 mM DTT was prepared using JNK buffer stock solution.(2) Assay buffer #2 with 0.025% BSA was prepared usi...
US Patent US9796706 (2017)
BindingDB Entry DOI: 10.7270/Q24T6MHK
Mitogen-activated protein kinase 9
(Homo sapiens (Human))
BDBM50352628
(CHEMBL1822309 | US9796706, Compound 136)
Show SMILES FC(F)(F)c1ccc2n(CC(=O)Nc3scc(C#N)c3-c3cscn3)c(=O)ccc2c1
Show InChI InChI=1S/C20H11F3N4O2S2/c21-20(22,23)13-2-3-15-11(5-13)1-4-17(29)27(15)7-16(28)26-19-18(12(6-24)8-31-19)14-9-30-10-25-14/h1-5,8-10H,7H2,(H,26,28)
NCI pathway
Reactome pathway
n/an/a 17n/an/an/an/an/an/a
Elan Pharmaceuticals
Curated by ChEMBL
Assay Description
Inhibition of recombinant JNK2 using ser73 of c-jun as substrate preincubated for 15 mins measured after 60 mins by TR-FRET assay
Bioorg Med Chem Lett 21: 5521-7 (2011)
Article DOI: 10.1016/j.bmcl.2011.06.100
BindingDB Entry DOI: 10.7270/Q29Z959K