BDBM50352864 CHEMBL1824142
SMILES: CN1C(N)=NC(C1=O)(c1cnn(c1)C1CCCC1)c1cccc(c1)-c1cncnc1
InChI Key: InChIKey=RSBLHFREHLCSDX-UHFFFAOYSA-N
Data: 3 IC50  1 EC50
Activity Spreadsheet -- Enzyme Inhibition Constant Data from BindingDB
Found 4 hits for monomerid = 50352864
Trg + Lig
Ki
nM
ΔG°
kcal/mole
IC50
nM
Kd
nM
EC50/IC50
nM
koff
s-1
kon
M-1s-1
pHTemp
°C
Beta-secretase 1
(Homo sapiens (Human))
BDBM50352864
(CHEMBL1824142)
Show SMILES CN1C(N)=NC(C1=O)(c1cnn(c1)C1CCCC1)c1cccc(c1)-c1cncnc1 |c:3|
Show InChI InChI=1S/C22H23N7O/c1-28-20(30)22(27-21(28)23,18-12-26-29(13-18)19-7-2-3-8-19)17-6-4-5-15(9-17)16-10-24-14-25-11-16/h4-6,9-14,19H,2-3,7-8H2,1H3,(H2,23,27)
n/an/an/an/a 1.50E+3n/an/an/an/a
Pfizer Inc.
Curated by ChEMBL
Assay Description
Inhibition of BACE1 expressed in CHO cells expressing wild type human APP assessed as inhibition of amyloid beta-40 or 42 production by ELISA assay
Bioorg Med Chem Lett 21: 5164-70 (2011)
Article DOI: 10.1016/j.bmcl.2011.07.057
BindingDB Entry DOI: 10.7270/Q2WQ045T
Cathepsin D
(Homo sapiens (Human))
BDBM50352864
(CHEMBL1824142)
Show SMILES CN1C(N)=NC(C1=O)(c1cnn(c1)C1CCCC1)c1cccc(c1)-c1cncnc1 |c:3|
Show InChI InChI=1S/C22H23N7O/c1-28-20(30)22(27-21(28)23,18-12-26-29(13-18)19-7-2-3-8-19)17-6-4-5-15(9-17)16-10-24-14-25-11-16/h4-6,9-14,19H,2-3,7-8H2,1H3,(H2,23,27)
NCI pathway
Reactome pathway
n/an/a 1.73E+4n/an/an/an/an/an/a
Pfizer Inc.
Curated by ChEMBL
Assay Description
Inhibition of cathepsin D by FRET assay
Bioorg Med Chem Lett 21: 5164-70 (2011)
Article DOI: 10.1016/j.bmcl.2011.07.057
BindingDB Entry DOI: 10.7270/Q2WQ045T
Beta-secretase 2
(Homo sapiens (Human))
BDBM50352864
(CHEMBL1824142)
Show SMILES CN1C(N)=NC(C1=O)(c1cnn(c1)C1CCCC1)c1cccc(c1)-c1cncnc1 |c:3|
Show InChI InChI=1S/C22H23N7O/c1-28-20(30)22(27-21(28)23,18-12-26-29(13-18)19-7-2-3-8-19)17-6-4-5-15(9-17)16-10-24-14-25-11-16/h4-6,9-14,19H,2-3,7-8H2,1H3,(H2,23,27)
n/an/a 170n/an/an/an/an/an/a
Pfizer Inc.
Curated by ChEMBL
Assay Description
Inhibition of BACE2 by FRET assay
Bioorg Med Chem Lett 21: 5164-70 (2011)
Article DOI: 10.1016/j.bmcl.2011.07.057
BindingDB Entry DOI: 10.7270/Q2WQ045T
Beta-secretase 1
(Homo sapiens (Human))
BDBM50352864
(CHEMBL1824142)
Show SMILES CN1C(N)=NC(C1=O)(c1cnn(c1)C1CCCC1)c1cccc(c1)-c1cncnc1 |c:3|
Show InChI InChI=1S/C22H23N7O/c1-28-20(30)22(27-21(28)23,18-12-26-29(13-18)19-7-2-3-8-19)17-6-4-5-15(9-17)16-10-24-14-25-11-16/h4-6,9-14,19H,2-3,7-8H2,1H3,(H2,23,27)
n/an/a 70n/an/an/an/an/an/a
Pfizer Inc.
Curated by ChEMBL
Assay Description
Inhibition of BACE1 by FRET assay
Bioorg Med Chem Lett 21: 5164-70 (2011)
Article DOI: 10.1016/j.bmcl.2011.07.057
BindingDB Entry DOI: 10.7270/Q2WQ045T