BDBM50352957 CHEMBL1824931
SMILES: Cc1ccc(F)cc1Oc1c(C(=O)N2CCNCC2)c2ncccc2n1-c1ccccc1
InChI Key: InChIKey=HDEHLTZZFKVMQF-UHFFFAOYSA-N
Data: 1 IC50
Activity Spreadsheet -- Enzyme Inhibition Constant Data from BindingDB
Found 1 hit for monomerid = 50352957
Trg + Lig
Ki
nM
ΔG°
kcal/mole
IC50
nM
Kd
nM
EC50/IC50
nM
koff
s-1
kon
M-1s-1
pHTemp
°C
Renin
(Homo sapiens (Human))
BDBM50352957
(CHEMBL1824931)
Show SMILES Cc1ccc(F)cc1Oc1c(C(=O)N2CCNCC2)c2ncccc2n1-c1ccccc1
Show InChI InChI=1S/C25H23FN4O2/c1-17-9-10-18(26)16-21(17)32-25-22(24(31)29-14-12-27-13-15-29)23-20(8-5-11-28-23)30(25)19-6-3-2-4-7-19/h2-11,16,27H,12-15H2,1H3
Reactome pathway
n/an/a 24n/an/an/an/an/an/a
Deutschland GmbH
Curated by ChEMBL
Assay Description
Inhibition of human recombinant renin using dabcyl-gamma-Abu-Ile-His-Pro-Phe-His-Leu-Val-Ile-His-Thr-EDANS as substrate preincubated for 30 mins afte...
Bioorg Med Chem Lett 21: 5480-6 (2011)
Article DOI: 10.1016/j.bmcl.2011.06.114
BindingDB Entry DOI: 10.7270/Q2HH6KFK