BDBM50352986 CHEMBL1824961
SMILES: Cc1cccc(C)c1Oc1c(C(=O)N2CCNCC2)c2ncc(O)cc2n1-c1ccccc1
InChI Key: InChIKey=YHXAIWINNKJAHF-UHFFFAOYSA-N
Data: 1 IC50
Activity Spreadsheet -- Enzyme Inhibition Constant Data from BindingDB
Found 1 hit for monomerid = 50352986
Trg + Lig
Ki
nM
ΔG°
kcal/mole
IC50
nM
Kd
nM
EC50/IC50
nM
koff
s-1
kon
M-1s-1
pHTemp
°C
Renin
(Homo sapiens (Human))
BDBM50352986
(CHEMBL1824961)
Show SMILES Cc1cccc(C)c1Oc1c(C(=O)N2CCNCC2)c2ncc(O)cc2n1-c1ccccc1
Show InChI InChI=1S/C26H26N4O3/c1-17-7-6-8-18(2)24(17)33-26-22(25(32)29-13-11-27-12-14-29)23-21(15-20(31)16-28-23)30(26)19-9-4-3-5-10-19/h3-10,15-16,27,31H,11-14H2,1-2H3
Reactome pathway
n/an/a 3n/an/an/an/an/an/a
Deutschland GmbH
Curated by ChEMBL
Assay Description
Inhibition of human recombinant renin using dabcyl-gamma-Abu-Ile-His-Pro-Phe-His-Leu-Val-Ile-His-Thr-EDANS as substrate preincubated for 30 mins afte...
Bioorg Med Chem Lett 21: 5480-6 (2011)
Article DOI: 10.1016/j.bmcl.2011.06.114
BindingDB Entry DOI: 10.7270/Q2HH6KFK