BDBM50353035 CHEMBL1822155
SMILES: COc1ccc(cc1O)C1Nc2cccc3cccc(N1)c23
InChI Key: InChIKey=GTHNINLDBDANIA-UHFFFAOYSA-N
Data: 2 IC50
Activity Spreadsheet -- Enzyme Inhibition Constant Data from BindingDB
Found 2 hits for monomerid = 50353035
Trg + Lig
Ki
nM
ΔG°
kcal/mole
IC50
nM
Kd
nM
EC50/IC50
nM
koff
s-1
kon
M-1s-1
pHTemp
°C
Androgen Receptor
(Homo sapiens (Human))
BDBM50353035
(CHEMBL1822155)
Show SMILES COc1ccc(cc1O)C1Nc2cccc3cccc(N1)c23
Show InChI InChI=1S/C18H16N2O2/c1-22-16-9-8-12(10-15(16)21)18-19-13-6-2-4-11-5-3-7-14(20-18)17(11)13/h2-10,18-21H,1H3
NCI pathway
Reactome pathway
n/an/a 3.44E+4n/an/an/an/an/an/a
University of British Columbia
Curated by ChEMBL
Assay Description
Inhibition of human AR AF2 site expressed in human LNCap cells coexpressing eGFP -ARR2PB assessed as inhibition of transcriptional activity
J Med Chem 54: 6197-205 (2011)
Article DOI: 10.1021/jm200532b
BindingDB Entry DOI: 10.7270/Q20G3KHB
Androgen Receptor
(Homo sapiens (Human))
BDBM50353035
(CHEMBL1822155)
Show SMILES COc1ccc(cc1O)C1Nc2cccc3cccc(N1)c23
Show InChI InChI=1S/C18H16N2O2/c1-22-16-9-8-12(10-15(16)21)18-19-13-6-2-4-11-5-3-7-14(20-18)17(11)13/h2-10,18-21H,1H3
NCI pathway
Reactome pathway
n/an/a 8.20E+3n/an/an/an/an/an/a
University of British Columbia
Curated by ChEMBL
Assay Description
Displacement of SRC2-3 peptide from human AR ligand binding site expressed in Escherichia coli BL21 by AF2 FP assay
J Med Chem 54: 6197-205 (2011)
Article DOI: 10.1021/jm200532b
BindingDB Entry DOI: 10.7270/Q20G3KHB