BDBM50353098 CHEMBL1829133
SMILES: COc1ccc(CN2CCN(CCCOc3ccc(cc3NS(=O)(=O)c3ccc(C)cc3)C(=O)NC(N)=N)CC2)c(OC)c1OC
InChI Key: InChIKey=AMVZKGKPUOJLBR-UHFFFAOYSA-N
Data: 1 IC50
Activity Spreadsheet -- Enzyme Inhibition Constant Data from BindingDB
Found 1 hit for monomerid = 50353098
Trg + Lig
Ki
nM
ΔG°
kcal/mole
IC50
nM
Kd
nM
EC50/IC50
nM
koff
s-1
kon
M-1s-1
pHTemp
°C
Sodium/hydrogen exchanger 1
(Rattus norvegicus)
BDBM50353098
(CHEMBL1829133)
Show SMILES COc1ccc(CN2CCN(CCCOc3ccc(cc3NS(=O)(=O)c3ccc(C)cc3)C(=O)NC(N)=N)CC2)c(OC)c1OC
Show InChI InChI=1S/C32H42N6O7S/c1-22-6-10-25(11-7-22)46(40,41)36-26-20-23(31(39)35-32(33)34)8-12-27(26)45-19-5-14-37-15-17-38(18-16-37)21-24-9-13-28(42-2)30(44-4)29(24)43-3/h6-13,20,36H,5,14-19,21H2,1-4H3,(H4,33,34,35,39)
Reactome pathway
n/an/a 0.560n/an/an/an/an/an/a
China Pharmaceutical University
Curated by ChEMBL
Assay Description
Inhibition of NHE1 in Sprague-Dawley rat assessed as inhibition of acid-induced platelet swelling by spectrophotometric analysis
Eur J Med Chem 46: 4107-16 (2011)
Article DOI: 10.1016/j.ejmech.2011.06.011
BindingDB Entry DOI: 10.7270/Q27081T0