BDBM50353574 CHEMBL1831088
SMILES: CNC(=O)C(C)(C)C(c1ccc(Nc2ccc3ccccc3c2)cc1)n1ccnc1
InChI Key: InChIKey=CJPBDDWMTPIOHJ-UHFFFAOYSA-N
Data: 1 IC50
Activity Spreadsheet -- Enzyme Inhibition Constant Data from BindingDB
Found 1 hit for monomerid = 50353574
Trg + Lig
Ki
nM
ΔG°
kcal/mole
IC50
nM
Kd
nM
EC50/IC50
nM
koff
s-1
kon
M-1s-1
pHTemp
°C
Cytochrome P450 26A1
(Homo sapiens (Human))
BDBM50353574
(CHEMBL1831088)
Show SMILES CNC(=O)C(C)(C)C(c1ccc(Nc2ccc3ccccc3c2)cc1)n1ccnc1
Show InChI InChI=1S/C25H26N4O/c1-25(2,24(30)26-3)23(29-15-14-27-17-29)19-9-11-21(12-10-19)28-22-13-8-18-6-4-5-7-20(18)16-22/h4-17,23,28H,1-3H3,(H,26,30)
Reactome pathway
n/an/a 12n/an/an/an/an/an/a
Cardiff University
Curated by ChEMBL
Assay Description
Inhibition of human CYP26A1 assessed using [11,12-3H]ATRA as substrate by scintillation counting
J Med Chem 54: 6803-11 (2011)
Article DOI: 10.1021/jm200695m
BindingDB Entry DOI: 10.7270/Q2WM1DSJ