BDBM50353575 CHEMBL1831089
SMILES: CC(C)NC(=O)C(C)(C)C(c1ccc(Nc2ccc3ccccc3c2)cc1)n1ccnc1
InChI Key: InChIKey=VKUPJDJTVJDNPB-UHFFFAOYSA-N
Data: 1 IC50
Activity Spreadsheet -- Enzyme Inhibition Constant Data from BindingDB
Found 1 hit for monomerid = 50353575
Trg + Lig
Ki
nM
ΔG°
kcal/mole
IC50
nM
Kd
nM
EC50/IC50
nM
koff
s-1
kon
M-1s-1
pHTemp
°C
Cytochrome CYP26A1
(Homo sapiens (Human))
BDBM50353575
(CHEMBL1831089)
Show SMILES CC(C)NC(=O)C(C)(C)C(c1ccc(Nc2ccc3ccccc3c2)cc1)n1ccnc1
Show InChI InChI=1S/C27H30N4O/c1-19(2)29-26(32)27(3,4)25(31-16-15-28-18-31)21-10-12-23(13-11-21)30-24-14-9-20-7-5-6-8-22(20)17-24/h5-19,25,30H,1-4H3,(H,29,32)
Reactome pathway
n/an/a 120n/an/an/an/an/an/a
Cardiff University
Curated by ChEMBL
Assay Description
Inhibition of human CYP26A1 assessed using [11,12-3H]ATRA as substrate by scintillation counting
J Med Chem 54: 6803-11 (2011)
Article DOI: 10.1021/jm200695m
BindingDB Entry DOI: 10.7270/Q2WM1DSJ