BDBM50353580 CHEMBL1831094
SMILES: CNC(=O)C(C)(C)C(c1ccc(Nc2ccc3ccccc3c2)cc1)n1cncn1
InChI Key: InChIKey=USSPWQGMEIGGND-UHFFFAOYSA-N
Data: 1 IC50
Activity Spreadsheet -- Enzyme Inhibition Constant Data from BindingDB
Found 1 hit for monomerid = 50353580
Trg + Lig
Ki
nM
ΔG°
kcal/mole
IC50
nM
Kd
nM
EC50/IC50
nM
koff
s-1
kon
M-1s-1
pHTemp
°C
Cytochrome P450 26A1
(Homo sapiens (Human))
BDBM50353580
(CHEMBL1831094)
Show SMILES CNC(=O)C(C)(C)C(c1ccc(Nc2ccc3ccccc3c2)cc1)n1cncn1
Show InChI InChI=1S/C24H25N5O/c1-24(2,23(30)25-3)22(29-16-26-15-27-29)18-9-11-20(12-10-18)28-21-13-8-17-6-4-5-7-19(17)14-21/h4-16,22,28H,1-3H3,(H,25,30)
Reactome pathway
n/an/a 350n/an/an/an/an/an/a
Cardiff University
Curated by ChEMBL
Assay Description
Inhibition of human CYP26A1 assessed using [11,12-3H]ATRA as substrate by scintillation counting
J Med Chem 54: 6803-11 (2011)
Article DOI: 10.1021/jm200695m
BindingDB Entry DOI: 10.7270/Q2WM1DSJ