BDBM50353643 CHEMBL1829808
SMILES: CCC1C(=O)CC(Cc2cccc(CCNS(=O)(=O)c3ccc(Cl)cc3)c2)C1=O
InChI Key: InChIKey=QXBUTSUGXHNWCN-UHFFFAOYSA-N
Data: 2 IC50
Activity Spreadsheet -- Enzyme Inhibition Constant Data from BindingDB
Found 2 hits for monomerid = 50353643
Trg + Lig
Ki
nM
ΔG°
kcal/mole
IC50
nM
Kd
nM
EC50/IC50
nM
koff
s-1
kon
M-1s-1
pHTemp
°C
TBXA2R
(MOUSE)
BDBM50353643
(CHEMBL1829808)
Show SMILES CCC1C(=O)CC(Cc2cccc(CCNS(=O)(=O)c3ccc(Cl)cc3)c2)C1=O
Show InChI InChI=1S/C22H24ClNO4S/c1-2-20-21(25)14-17(22(20)26)13-16-5-3-4-15(12-16)10-11-24-29(27,28)19-8-6-18(23)7-9-19/h3-9,12,17,20,24H,2,10-11,13-14H2,1H3
Reactome pathway
n/an/a 9.40n/an/an/an/an/an/a
University of Pennsylvania
Curated by ChEMBL
Assay Description
Antagonist activity at mouse prostanoid TP receptor expressed in QBI-HEK 293A cells assessed as inhibition of 1-BOP-induced increase in inositol mono...
J Med Chem 54: 6969-83 (2011)
Article DOI: 10.1021/jm200980u
BindingDB Entry DOI: 10.7270/Q2H995KG
Prostanoid TP receptor
(Homo sapiens (Human))
BDBM50353643
(CHEMBL1829808)
Show SMILES CCC1C(=O)CC(Cc2cccc(CCNS(=O)(=O)c3ccc(Cl)cc3)c2)C1=O
Show InChI InChI=1S/C22H24ClNO4S/c1-2-20-21(25)14-17(22(20)26)13-16-5-3-4-15(12-16)10-11-24-29(27,28)19-8-6-18(23)7-9-19/h3-9,12,17,20,24H,2,10-11,13-14H2,1H3
n/an/a 171n/an/an/an/an/an/a
University of Pennsylvania
Curated by ChEMBL
Assay Description
Antagonist activity at human prostanoid TP receptor expressed in QBI-HEK 293A cells assessed as inhibition of 1-BOP-induced increase in inositol mono...
J Med Chem 54: 6969-83 (2011)
Article DOI: 10.1021/jm200980u
BindingDB Entry DOI: 10.7270/Q2H995KG