BDBM50353940 CHEMBL1828653
SMILES: Fc1cccc2N(c3ccccc3F)S(=O)(=O)N(CCC3CNCCO3)c12
InChI Key: InChIKey=MZTLLFJYLUUPPP-UHFFFAOYSA-N
Data: 3 IC50
Activity Spreadsheet -- Enzyme Inhibition Constant Data from BindingDB
Found 3 hits for monomerid = 50353940
Trg + Lig
Ki
nM
ΔG°
kcal/mole
IC50
nM
Kd
nM
EC50/IC50
nM
koff
s-1
kon
M-1s-1
pHTemp
°C
Sodium-dependent noradrenaline transporter
(Homo sapiens (Human))
BDBM50353940
(CHEMBL1828653)
Show SMILES Fc1cccc2N(c3ccccc3F)S(=O)(=O)N(CCC3CNCCO3)c12
Show InChI InChI=1S/C18H19F2N3O3S/c19-14-4-1-2-6-16(14)23-17-7-3-5-15(20)18(17)22(27(23,24)25)10-8-13-12-21-9-11-26-13/h1-7,13,21H,8-12H2
Reactome pathway
n/an/a 22n/an/an/an/an/an/a
Pfizer Inc.
Curated by ChEMBL
Assay Description
Inhibition of human NET expressed in MDCK-Net6 cells assessed as inhibition of norepinephrine uptake
J Med Chem 54: 6824-31 (2011)
Article DOI: 10.1021/jm200733r
BindingDB Entry DOI: 10.7270/Q2XD1227
Sodium-dependent serotonin transporter
(Homo sapiens (Human))
BDBM50353940
(CHEMBL1828653)
Show SMILES Fc1cccc2N(c3ccccc3F)S(=O)(=O)N(CCC3CNCCO3)c12
Show InChI InChI=1S/C18H19F2N3O3S/c19-14-4-1-2-6-16(14)23-17-7-3-5-15(20)18(17)22(27(23,24)25)10-8-13-12-21-9-11-26-13/h1-7,13,21H,8-12H2
n/an/a 992n/an/an/an/an/an/a
Pfizer Inc.
Curated by ChEMBL
Assay Description
Inhibition of human SERT expressed in JAR cells assessed as serotonin uptake
J Med Chem 54: 6824-31 (2011)
Article DOI: 10.1021/jm200733r
BindingDB Entry DOI: 10.7270/Q2XD1227
Sodium-dependent noradrenaline transporter
(Homo sapiens (Human))
BDBM50353940
(CHEMBL1828653)
Show SMILES Fc1cccc2N(c3ccccc3F)S(=O)(=O)N(CCC3CNCCO3)c12
Show InChI InChI=1S/C18H19F2N3O3S/c19-14-4-1-2-6-16(14)23-17-7-3-5-15(20)18(17)22(27(23,24)25)10-8-13-12-21-9-11-26-13/h1-7,13,21H,8-12H2
Reactome pathway
n/an/a 5n/an/an/an/an/an/a
Pfizer Inc.
Curated by ChEMBL
Assay Description
Displacement of [3H]nisoxetine from human NET expressed in MDCK-Net6 cells
J Med Chem 54: 6824-31 (2011)
Article DOI: 10.1021/jm200733r
BindingDB Entry DOI: 10.7270/Q2XD1227