BDBM50354040 CHEMBL1829583
SMILES: OC(=O)CCNC(=O)[C@H](Cc1ccc(cc1)-c1ccccc1)NCC(O)=O
InChI Key: InChIKey=DAGYBRMCMQPGRX-KRWDZBQOSA-N
Data: 1 IC50
Activity Spreadsheet -- Enzyme Inhibition Constant Data from BindingDB
Found 1 hit for monomerid = 50354040
Trg + Lig
Ki
nM
ΔG°
kcal/mole
IC50
nM
Kd
nM
EC50/IC50
nM
koff
s-1
kon
M-1s-1
pHTemp
°C
Neprilysin
(Homo sapiens (Human))
BDBM50354040
(CHEMBL1829583)
Show SMILES OC(=O)CCNC(=O)[C@H](Cc1ccc(cc1)-c1ccccc1)NCC(O)=O |r|
Show InChI InChI=1S/C20H22N2O5/c23-18(24)10-11-21-20(27)17(22-13-19(25)26)12-14-6-8-16(9-7-14)15-4-2-1-3-5-15/h1-9,17,22H,10-13H2,(H,21,27)(H,23,24)(H,25,26)/t17-/m0/s1
n/an/a 9.70n/an/an/an/an/an/a
Kao Corporation
Curated by ChEMBL
Assay Description
Inhibition of neutral endopeptidase in human fibroblasts homogenates using glutaryl-Ala-Ala-Phe-4-methoxy-2-naphtylamide as substrate after 1 hrs by ...
Bioorg Med Chem 19: 5935-47 (2011)
Article DOI: 10.1016/j.bmc.2011.08.064
BindingDB Entry DOI: 10.7270/Q2154HF6