BDBM50354043 CHEMBL1829586
SMILES: C[C@@H](CNC(=O)[C@H](Cc1ccc(C)cc1)N[C@@H](CCc1ccccc1)C(O)=O)C(O)=O
InChI Key: InChIKey=OWPYYZUAFDLVRD-YYWHXJBOSA-N
Data: 1 IC50
Activity Spreadsheet -- Enzyme Inhibition Constant Data from BindingDB
Found 1 hit for monomerid = 50354043
Trg + Lig
Ki
nM
ΔG°
kcal/mole
IC50
nM
Kd
nM
EC50/IC50
nM
koff
s-1
kon
M-1s-1
pHTemp
°C
Neprilysin
(Homo sapiens (Human))
BDBM50354043
(CHEMBL1829586)
Show SMILES C[C@@H](CNC(=O)[C@H](Cc1ccc(C)cc1)N[C@@H](CCc1ccccc1)C(O)=O)C(O)=O |r|
Show InChI InChI=1S/C24H30N2O5/c1-16-8-10-19(11-9-16)14-21(22(27)25-15-17(2)23(28)29)26-20(24(30)31)13-12-18-6-4-3-5-7-18/h3-11,17,20-21,26H,12-15H2,1-2H3,(H,25,27)(H,28,29)(H,30,31)/t17-,20-,21-/m0/s1
n/an/a 430n/an/an/an/an/an/a
Kao Corporation
Curated by ChEMBL
Assay Description
Inhibition of neutral endopeptidase in human fibroblasts homogenates using glutaryl-Ala-Ala-Phe-4-methoxy-2-naphtylamide as substrate after 1 hrs by ...
Bioorg Med Chem 19: 5935-47 (2011)
Article DOI: 10.1016/j.bmc.2011.08.064
BindingDB Entry DOI: 10.7270/Q2154HF6