BDBM50354051 CHEMBL1836309
SMILES: CC(=O)N[C@@H]1[C@@H](O)C[C@@](O[C@H]2[C@@H](O)[C@@H](CO)O[C@@H](O[C@H]3[C@@H](O)[C@@H](CO)O[C@H](OCc4ccccc4)[C@@H]3NC(C)=O)[C@@H]2O)(O[C@H]1[C@H](O)[C@H](O)CO)C([O-])=O
InChI Key: InChIKey=VREZLEQJIVCNEC-MNNJAZERSA-M
Data: 1 IC50
Activity Spreadsheet -- Enzyme Inhibition Constant Data from BindingDB
Found 1 hit for monomerid = 50354051
Trg + Lig
Ki
nM
ΔG°
kcal/mole
IC50
nM
Kd
nM
EC50/IC50
nM
koff
s-1
kon
M-1s-1
pHTemp
°C
Myelin-associated glycoprotein
(Homo sapiens (Human))
BDBM50354051
(CHEMBL1836309)
Show SMILES CC(=O)N[C@@H]1[C@@H](O)C[C@@](O[C@H]2[C@@H](O)[C@@H](CO)O[C@@H](O[C@H]3[C@@H](O)[C@@H](CO)O[C@H](OCc4ccccc4)[C@@H]3NC(C)=O)[C@@H]2O)(O[C@H]1[C@H](O)[C@H](O)CO)C([O-])=O |r|
Show InChI InChI=1S/C32H48N2O19/c1-13(38)33-20-16(40)8-32(31(46)47,52-27(20)22(42)17(41)9-35)53-28-24(44)19(11-37)50-30(25(28)45)51-26-21(34-14(2)39)29(49-18(10-36)23(26)43)48-12-15-6-4-3-5-7-15/h3-7,16-30,35-37,40-45H,8-12H2,1-2H3,(H,33,38)(H,34,39)(H,46,47)/p-1/t16-,17+,18+,19+,20+,21+,22+,23-,24-,25+,26+,27+,28-,29-,30-,32-/m0/s1
NCI pathway
Reactome pathway
n/an/a 5.20E+4n/an/an/an/an/an/a
The Scripps Research Institute
Curated by ChEMBL
Assay Description
Inhibition of MAG
Bioorg Med Chem Lett 21: 5045-9 (2011)
Article DOI: 10.1016/j.bmcl.2011.04.068
BindingDB Entry DOI: 10.7270/Q2WD40ZW