BDBM50354055 CHEMBL1836335
SMILES: COC(=O)[C@@H](NC(C)=O)[C@@H](C)O[C@H]1O[C@H](CO)[C@H](O)[C@H](O[C@@H]2O[C@H](CO)[C@H](O)[C@H](O[C@@]3(C[C@H](O)[C@@H](NC(C)=O)[C@@H](O3)[C@H](O)[C@H](O)CNC(=O)c3ccc(Cl)cc3)C([O-])=O)[C@H]2O)[C@H]1NC(C)=O
InChI Key: InChIKey=QATRWOBUZRGCQK-DEXPQUCXSA-M
Data: 1 IC50  1 Kd
Activity Spreadsheet -- Enzyme Inhibition Constant Data from BindingDB
Found 2 hits for monomerid = 50354055
Trg + Lig
Ki
nM
ΔG°
kcal/mole
IC50
nM
Kd
nM
EC50/IC50
nM
koff
s-1
kon
M-1s-1
pHTemp
°C
Myelin-associated glycoprotein
(Homo sapiens (Human))
BDBM50354055
(CHEMBL1836335)
Show SMILES COC(=O)[C@@H](NC(C)=O)[C@@H](C)O[C@H]1O[C@H](CO)[C@H](O)[C@H](O[C@@H]2O[C@H](CO)[C@H](O)[C@H](O[C@@]3(C[C@H](O)[C@@H](NC(C)=O)[C@@H](O3)[C@H](O)[C@H](O)CNC(=O)c3ccc(Cl)cc3)C([O-])=O)[C@H]2O)[C@H]1NC(C)=O |r|
Show InChI InChI=1S/C39H57ClN4O22/c1-14(24(35(57)60-5)42-15(2)47)61-36-26(44-17(4)49)31(28(53)22(12-45)62-36)64-37-30(55)33(29(54)23(13-46)63-37)66-39(38(58)59)10-20(50)25(43-16(3)48)32(65-39)27(52)21(51)11-41-34(56)18-6-8-19(40)9-7-18/h6-9,14,20-33,36-37,45-46,50-55H,10-13H2,1-5H3,(H,41,56)(H,42,47)(H,43,48)(H,44,49)(H,58,59)/p-1/t14-,20+,21-,22-,23-,24+,25-,26-,27-,28+,29+,30-,31-,32-,33+,36+,37+,39+/m1/s1
NCI pathway
Reactome pathway
n/an/an/a 1.00E+3n/an/an/an/an/a
The Scripps Research Institute
Curated by ChEMBL
Assay Description
Binding affinity to wild type MAG at 400 uM by Isothermal titration calorimetry
Bioorg Med Chem Lett 21: 5045-9 (2011)
Article DOI: 10.1016/j.bmcl.2011.04.068
BindingDB Entry DOI: 10.7270/Q2WD40ZW
Myelin-associated glycoprotein
(Homo sapiens (Human))
BDBM50354055
(CHEMBL1836335)
Show SMILES COC(=O)[C@@H](NC(C)=O)[C@@H](C)O[C@H]1O[C@H](CO)[C@H](O)[C@H](O[C@@H]2O[C@H](CO)[C@H](O)[C@H](O[C@@]3(C[C@H](O)[C@@H](NC(C)=O)[C@@H](O3)[C@H](O)[C@H](O)CNC(=O)c3ccc(Cl)cc3)C([O-])=O)[C@H]2O)[C@H]1NC(C)=O |r|
Show InChI InChI=1S/C39H57ClN4O22/c1-14(24(35(57)60-5)42-15(2)47)61-36-26(44-17(4)49)31(28(53)22(12-45)62-36)64-37-30(55)33(29(54)23(13-46)63-37)66-39(38(58)59)10-20(50)25(43-16(3)48)32(65-39)27(52)21(51)11-41-34(56)18-6-8-19(40)9-7-18/h6-9,14,20-33,36-37,45-46,50-55H,10-13H2,1-5H3,(H,41,56)(H,42,47)(H,43,48)(H,44,49)(H,58,59)/p-1/t14-,20+,21-,22-,23-,24+,25-,26-,27-,28+,29+,30-,31-,32-,33+,36+,37+,39+/m1/s1
NCI pathway
Reactome pathway
n/an/a 610n/an/an/an/an/an/a
The Scripps Research Institute
Curated by ChEMBL
Assay Description
Inhibition of MAG -Fc chimera expressed in CHO cells using NeuAc alpha2-3Galbeta1-4GlcNAc-R coupled biotinylated polyacrylamide after 30 mins by ELIS...
Bioorg Med Chem Lett 21: 5045-9 (2011)
Article DOI: 10.1016/j.bmcl.2011.04.068
BindingDB Entry DOI: 10.7270/Q2WD40ZW