BDBM50354254 CHEMBL1836506
SMILES: Clc1ccc(CSc2nc(SCc3ccccc3)nc(=O)[nH]2)cc1
InChI Key: InChIKey=ZGTXTQCWNZHCTO-UHFFFAOYSA-N
Data: 2 KI  2 IC50
Activity Spreadsheet -- Enzyme Inhibition Constant Data from BindingDB
Found 4 hits for monomerid = 50354254
Trg + Lig
Ki
nM
ΔG°
kcal/mole
IC50
nM
Kd
nM
EC50/IC50
nM
koff
s-1
kon
M-1s-1
pHTemp
°C
Cathepsin B
(Homo sapiens (Human))
BDBM50354254
(CHEMBL1836506)
Show SMILES Clc1ccc(CSc2nc(SCc3ccccc3)nc(=O)[nH]2)cc1
Show InChI InChI=1S/C17H14ClN3OS2/c18-14-8-6-13(7-9-14)11-24-17-20-15(22)19-16(21-17)23-10-12-4-2-1-3-5-12/h1-9H,10-11H2,(H,19,20,21,22)
Reactome pathway
2.50E+3n/an/an/an/an/an/an/an/a
University of Ljubljana
Curated by ChEMBL
Assay Description
Partial mixed-type inhibition of human recombinant cathepsin B assessed as formation of fluorescent degradation product AMC using Z-Arg-Arg-AMC as su...
Eur J Med Chem 46: 4648-56 (2011)
Article DOI: 10.1016/j.ejmech.2011.08.005
BindingDB Entry DOI: 10.7270/Q2M045TJ
Cathepsin B
(Homo sapiens (Human))
BDBM50354254
(CHEMBL1836506)
Show SMILES Clc1ccc(CSc2nc(SCc3ccccc3)nc(=O)[nH]2)cc1
Show InChI InChI=1S/C17H14ClN3OS2/c18-14-8-6-13(7-9-14)11-24-17-20-15(22)19-16(21-17)23-10-12-4-2-1-3-5-12/h1-9H,10-11H2,(H,19,20,21,22)
Reactome pathway
4.40E+3n/an/an/an/an/an/an/an/a
University of Ljubljana
Curated by ChEMBL
Assay Description
Reversible inhibition of human recombinant cathepsin B assessed as formation of fluorescent degradation product AMC using Z-Arg-Arg-AMC as substrate ...
Eur J Med Chem 46: 4648-56 (2011)
Article DOI: 10.1016/j.ejmech.2011.08.005
BindingDB Entry DOI: 10.7270/Q2M045TJ
Topoisomerase I/II
(Homo sapiens (Human))
BDBM50354254
(CHEMBL1836506)
Show SMILES Clc1ccc(CSc2nc(SCc3ccccc3)nc(=O)[nH]2)cc1
Show InChI InChI=1S/C17H14ClN3OS2/c18-14-8-6-13(7-9-14)11-24-17-20-15(22)19-16(21-17)23-10-12-4-2-1-3-5-12/h1-9H,10-11H2,(H,19,20,21,22)
n/an/a 2.19E+5n/an/an/an/an/an/a
Slovenia; University of Ljubljana
Curated by ChEMBL
Assay Description
Inhibition of human topoisomerase 2alpha using supercoiled pNO1 plasmid as substrate after 30 mins by HTS assay
Eur J Med Chem 175: 330-348 (2019)
Article DOI: 10.1016/j.ejmech.2019.04.055
Topoisomerase II alpha (HuTopoIIα)
(Homo sapiens (Human))
BDBM50354254
(CHEMBL1836506)
Show SMILES Clc1ccc(CSc2nc(SCc3ccccc3)nc(=O)[nH]2)cc1
Show InChI InChI=1S/C17H14ClN3OS2/c18-14-8-6-13(7-9-14)11-24-17-20-15(22)19-16(21-17)23-10-12-4-2-1-3-5-12/h1-9H,10-11H2,(H,19,20,21,22)
n/an/a 2.19E+5n/an/an/an/an/an/a
National Institute of Chemistry
Curated by ChEMBL
Assay Description
Inhibition of human DNA topoisomerase IIalpha using plasmid pNO1 as a substrate after 30 mins
Bioorg Med Chem 23: 4218-29 (2015)
BindingDB Entry DOI: 10.7270/Q2RJ4M72