BDBM50354255 CHEMBL1836468
SMILES: [O-][N+](=O)c1ccc(CSc2nc(SCc3ccccc3)nc(=O)[nH]2)cc1
InChI Key: InChIKey=AZDZBZFUDDHCPQ-UHFFFAOYSA-N
Data: 2 KI  1 IC50
Activity Spreadsheet -- Enzyme Inhibition Constant Data from BindingDB
Found 3 hits for monomerid = 50354255
Trg + Lig
Ki
nM
ΔG°
kcal/mole
IC50
nM
Kd
nM
EC50/IC50
nM
koff
s-1
kon
M-1s-1
pHTemp
°C
Cathepsin B
(Homo sapiens (Human))
BDBM50354255
(CHEMBL1836468)
Show SMILES [O-][N+](=O)c1ccc(CSc2nc(SCc3ccccc3)nc(=O)[nH]2)cc1
Show InChI InChI=1S/C17H14N4O3S2/c22-15-18-16(25-10-12-4-2-1-3-5-12)20-17(19-15)26-11-13-6-8-14(9-7-13)21(23)24/h1-9H,10-11H2,(H,18,19,20,22)
Reactome pathway
4.00E+3n/an/an/an/an/an/an/an/a
University of Ljubljana
Curated by ChEMBL
Assay Description
Partial mixed-type inhibition of human recombinant cathepsin B assessed as formation of fluorescent degradation product AMC using Z-Arg-Arg-AMC as su...
Eur J Med Chem 46: 4648-56 (2011)
Article DOI: 10.1016/j.ejmech.2011.08.005
BindingDB Entry DOI: 10.7270/Q2M045TJ
Cathepsin B
(Homo sapiens (Human))
BDBM50354255
(CHEMBL1836468)
Show SMILES [O-][N+](=O)c1ccc(CSc2nc(SCc3ccccc3)nc(=O)[nH]2)cc1
Show InChI InChI=1S/C17H14N4O3S2/c22-15-18-16(25-10-12-4-2-1-3-5-12)20-17(19-15)26-11-13-6-8-14(9-7-13)21(23)24/h1-9H,10-11H2,(H,18,19,20,22)
Reactome pathway
1.00E+4n/an/an/an/an/an/an/an/a
University of Ljubljana
Curated by ChEMBL
Assay Description
Reversible inhibition of human recombinant cathepsin B assessed as formation of fluorescent degradation product AMC using Z-Arg-Arg-AMC as substrate ...
Eur J Med Chem 46: 4648-56 (2011)
Article DOI: 10.1016/j.ejmech.2011.08.005
BindingDB Entry DOI: 10.7270/Q2M045TJ
Topoisomerase II alpha (HuTopoIIα)
(Homo sapiens (Human))
BDBM50354255
(CHEMBL1836468)
Show SMILES [O-][N+](=O)c1ccc(CSc2nc(SCc3ccccc3)nc(=O)[nH]2)cc1
Show InChI InChI=1S/C17H14N4O3S2/c22-15-18-16(25-10-12-4-2-1-3-5-12)20-17(19-15)26-11-13-6-8-14(9-7-13)21(23)24/h1-9H,10-11H2,(H,18,19,20,22)
n/an/a 3.59E+5n/an/an/an/an/an/a
National Institute of Chemistry
Curated by ChEMBL
Assay Description
Inhibition of human DNA topoisomerase IIalpha using plasmid pNO1 as a substrate after 30 mins
Bioorg Med Chem 23: 4218-29 (2015)
BindingDB Entry DOI: 10.7270/Q2RJ4M72