BDBM50354415 CHEMBL1836854
SMILES: Fc1cc(ccc1Nc1nc(cn2c(cnc12)-c1cn[nH]c1)C1CC1)C(=O)N1CCNCC1
InChI Key: InChIKey=ZEZGZTLWRQKVFN-UHFFFAOYSA-N
Data: 4 IC50
Activity Spreadsheet -- Enzyme Inhibition Constant Data from BindingDB
Found 4 hits for monomerid = 50354415
Trg + Lig
Ki
nM
ΔG°
kcal/mole
IC50
nM
Kd
nM
EC50/IC50
nM
koff
s-1
kon
M-1s-1
pHTemp
°C
Aurora kinase B
(Homo sapiens (Human))
BDBM50354415
(CHEMBL1836854)
Show SMILES Fc1cc(ccc1Nc1nc(cn2c(cnc12)-c1cn[nH]c1)C1CC1)C(=O)N1CCNCC1
Show InChI InChI=1S/C23H23FN8O/c24-17-9-15(23(33)31-7-5-25-6-8-31)3-4-18(17)29-21-22-26-12-20(16-10-27-28-11-16)32(22)13-19(30-21)14-1-2-14/h3-4,9-14,25H,1-2,5-8H2,(H,27,28)(H,29,30)
Reactome pathway
n/an/a>2.00E+4n/an/an/an/an/an/a
Merck Research Laboratories
Curated by ChEMBL
Assay Description
Inhibition of AurB
Bioorg Med Chem Lett 21: 5870-5 (2011)
Article DOI: 10.1016/j.bmcl.2011.07.101
BindingDB Entry DOI: 10.7270/Q2PR7WCR
Tyrosine-protein kinase BRK
(Homo sapiens (Human))
BDBM50354415
(CHEMBL1836854)
Show SMILES Fc1cc(ccc1Nc1nc(cn2c(cnc12)-c1cn[nH]c1)C1CC1)C(=O)N1CCNCC1
Show InChI InChI=1S/C23H23FN8O/c24-17-9-15(23(33)31-7-5-25-6-8-31)3-4-18(17)29-21-22-26-12-20(16-10-27-28-11-16)32(22)13-19(30-21)14-1-2-14/h3-4,9-14,25H,1-2,5-8H2,(H,27,28)(H,29,30)
n/an/a 3n/an/an/an/an/an/a
Merck Research Laboratories
Curated by ChEMBL
Assay Description
Inhibition of BRK pretreated for 30 mins by microplate reader
Bioorg Med Chem Lett 21: 5870-5 (2011)
Article DOI: 10.1016/j.bmcl.2011.07.101
BindingDB Entry DOI: 10.7270/Q2PR7WCR
Tyrosine-protein kinase Lck
(Homo sapiens (Human))
BDBM50354415
(CHEMBL1836854)
Show SMILES Fc1cc(ccc1Nc1nc(cn2c(cnc12)-c1cn[nH]c1)C1CC1)C(=O)N1CCNCC1
Show InChI InChI=1S/C23H23FN8O/c24-17-9-15(23(33)31-7-5-25-6-8-31)3-4-18(17)29-21-22-26-12-20(16-10-27-28-11-16)32(22)13-19(30-21)14-1-2-14/h3-4,9-14,25H,1-2,5-8H2,(H,27,28)(H,29,30)
n/an/a>2.00E+4n/an/an/an/an/an/a
Merck Research Laboratories
Curated by ChEMBL
Assay Description
Inhibition of LCK
Bioorg Med Chem Lett 21: 5870-5 (2011)
Article DOI: 10.1016/j.bmcl.2011.07.101
BindingDB Entry DOI: 10.7270/Q2PR7WCR
Tyrosine-protein kinase BRK
(Homo sapiens (Human))
BDBM50354415
(CHEMBL1836854)
Show SMILES Fc1cc(ccc1Nc1nc(cn2c(cnc12)-c1cn[nH]c1)C1CC1)C(=O)N1CCNCC1
Show InChI InChI=1S/C23H23FN8O/c24-17-9-15(23(33)31-7-5-25-6-8-31)3-4-18(17)29-21-22-26-12-20(16-10-27-28-11-16)32(22)13-19(30-21)14-1-2-14/h3-4,9-14,25H,1-2,5-8H2,(H,27,28)(H,29,30)
n/an/a 7n/an/an/an/an/an/a
Merck Research Laboratories
Curated by ChEMBL
Assay Description
Inhibition of phosphorylated SAM68 in 293 WT-PTK6 cells after 3 hrs
Bioorg Med Chem Lett 21: 5870-5 (2011)
Article DOI: 10.1016/j.bmcl.2011.07.101
BindingDB Entry DOI: 10.7270/Q2PR7WCR