BDBM50354527 CHEMBL1836819
SMILES: COc1ccc2c(c1)c(=O)c1c(NCC[N+](C)(C)[O-])ccc3ncn2c13
InChI Key: InChIKey=HCOFDHMYUHQATQ-UHFFFAOYSA-N
Data: 2 IC50
Activity Spreadsheet -- Enzyme Inhibition Constant Data from BindingDB
Found 2 hits for monomerid = 50354527
Trg + Lig
Ki
nM
ΔG°
kcal/mole
IC50
nM
Kd
nM
EC50/IC50
nM
koff
s-1
kon
M-1s-1
pHTemp
°C
Ribosyldihydronicotinamide dehydrogenase [quinone]
(Homo sapiens (Human))
BDBM50354527
(CHEMBL1836819)
Show SMILES COc1ccc2c(c1)c(=O)c1c(NCC[N+](C)(C)[O-])ccc3ncn2c13
Show InChI InChI=1S/C19H20N4O3/c1-23(2,25)9-8-20-14-5-6-15-18-17(14)19(24)13-10-12(26-3)4-7-16(13)22(18)11-21-15/h4-7,10-11,20H,8-9H2,1-3H3
n/an/a 98n/an/an/an/an/an/a
University of Manchester
Curated by ChEMBL
Assay Description
Inhibition of human recombinant NQO2 assessed as reduction of DCPIP by spectrophotometry in the presence of 2 uM BSA
J Med Chem 54: 6597-611 (2011)
Article DOI: 10.1021/jm200416e
BindingDB Entry DOI: 10.7270/Q21Z44TH
Ribosyldihydronicotinamide dehydrogenase [quinone]
(Homo sapiens (Human))
BDBM50354527
(CHEMBL1836819)
Show SMILES COc1ccc2c(c1)c(=O)c1c(NCC[N+](C)(C)[O-])ccc3ncn2c13
Show InChI InChI=1S/C19H20N4O3/c1-23(2,25)9-8-20-14-5-6-15-18-17(14)19(24)13-10-12(26-3)4-7-16(13)22(18)11-21-15/h4-7,10-11,20H,8-9H2,1-3H3
n/an/a 14n/an/an/an/an/an/a
University of Manchester
Curated by ChEMBL
Assay Description
Inhibition of human recombinant NQO2 assessed as reduction of DCPIP by spectrophotometry
J Med Chem 54: 6597-611 (2011)
Article DOI: 10.1021/jm200416e
BindingDB Entry DOI: 10.7270/Q21Z44TH