BDBM50354531 CHEMBL1836817
SMILES: CN(C)CCNc1ccc2nc(C)n3c2c1c(=O)c1cc(F)ccc31
InChI Key: InChIKey=KPWXNVNNCQMVCZ-UHFFFAOYSA-N
Data: 1 IC50
Activity Spreadsheet -- Enzyme Inhibition Constant Data from BindingDB
Found 1 hit for monomerid = 50354531
Trg + Lig
Ki
nM
ΔG°
kcal/mole
IC50
nM
Kd
nM
EC50/IC50
nM
koff
s-1
kon
M-1s-1
pHTemp
°C
Ribosyldihydronicotinamide dehydrogenase [quinone]
(Homo sapiens (Human))
BDBM50354531
(CHEMBL1836817)
Show SMILES CN(C)CCNc1ccc2nc(C)n3c2c1c(=O)c1cc(F)ccc31
Show InChI InChI=1S/C19H19FN4O/c1-11-22-15-6-5-14(21-8-9-23(2)3)17-18(15)24(11)16-7-4-12(20)10-13(16)19(17)25/h4-7,10,21H,8-9H2,1-3H3
n/an/a 83n/an/an/an/an/an/a
University of Manchester
Curated by ChEMBL
Assay Description
Inhibition of human recombinant NQO2 assessed as reduction of DCPIP by spectrophotometry
J Med Chem 54: 6597-611 (2011)
Article DOI: 10.1021/jm200416e
BindingDB Entry DOI: 10.7270/Q21Z44TH