BDBM50354554 CHEMBL1836728
SMILES: COc1ccc(cn1)-c1cc2ncnc(SCC(O)=O)c2s1
InChI Key: InChIKey=AGBBSOYJENLDIA-UHFFFAOYSA-N
Data: 1 IC50
Activity Spreadsheet -- Enzyme Inhibition Constant Data from BindingDB
Found 1 hit for monomerid = 50354554
Trg + Lig
Ki
nM
ΔG°
kcal/mole
IC50
nM
Kd
nM
EC50/IC50
nM
koff
s-1
kon
M-1s-1
pHTemp
°C
Mitogen-activated protein kinase kinase kinase 8
(Homo sapiens (Human))
BDBM50354554
(CHEMBL1836728)
Show SMILES COc1ccc(cn1)-c1cc2ncnc(SCC(O)=O)c2s1
Show InChI InChI=1S/C14H11N3O3S2/c1-20-11-3-2-8(5-15-11)10-4-9-13(22-10)14(17-7-16-9)21-6-12(18)19/h2-5,7H,6H2,1H3,(H,18,19)
NCI pathway
Reactome pathway
n/an/a 2.20E+4n/an/an/an/an/an/a
Pfizer Inc.
Curated by ChEMBL
Assay Description
Inhibition of TPL2
Bioorg Med Chem Lett 21: 5952-6 (2011)
Article DOI: 10.1016/j.bmcl.2011.07.069
BindingDB Entry DOI: 10.7270/Q2X63NC0