BDBM50354561 CHEMBL1836729
SMILES: OC(=O)CSc1ncnc2cc(sc12)-c1ccc(Cl)s1
InChI Key: InChIKey=UOAGMKONDXWVFY-UHFFFAOYSA-N
Data: 1 IC50
Activity Spreadsheet -- Enzyme Inhibition Constant Data from BindingDB
Found 1 hit for monomerid = 50354561
Trg + Lig
Ki
nM
ΔG°
kcal/mole
IC50
nM
Kd
nM
EC50/IC50
nM
koff
s-1
kon
M-1s-1
pHTemp
°C
Mitogen-activated protein kinase kinase kinase 8
(Homo sapiens (Human))
BDBM50354561
(CHEMBL1836729)
Show SMILES OC(=O)CSc1ncnc2cc(sc12)-c1ccc(Cl)s1
Show InChI InChI=1S/C12H7ClN2O2S3/c13-9-2-1-7(19-9)8-3-6-11(20-8)12(15-5-14-6)18-4-10(16)17/h1-3,5H,4H2,(H,16,17)
NCI pathway
Reactome pathway
n/an/a>1.00E+5n/an/an/an/an/an/a
Pfizer Inc.
Curated by ChEMBL
Assay Description
Inhibition of TPL2
Bioorg Med Chem Lett 21: 5952-6 (2011)
Article DOI: 10.1016/j.bmcl.2011.07.069
BindingDB Entry DOI: 10.7270/Q2X63NC0