BDBM50354565 CHEMBL1836719
SMILES: CSc1ccc(cc1)-c1cc2ncnc(SCC(O)=O)c2s1
InChI Key: InChIKey=KJCQGDBVLKOAHP-UHFFFAOYSA-N
Data: 1 IC50
PDB links: 1 PDB ID matches this monomer.
Activity Spreadsheet -- Enzyme Inhibition Constant Data from BindingDB
Found 5 hits for monomerid = 50354565
Trg + Lig
Ki
nM
ΔG°
kcal/mole
IC50
nM
Kd
nM
EC50/IC50
nM
koff
s-1
kon
M-1s-1
pHTemp
°C
Mitogen-activated protein kinase kinase kinase 8
(Homo sapiens (Human))
BDBM50354565
(CHEMBL1836719)
Show SMILES CSc1ccc(cc1)-c1cc2ncnc(SCC(O)=O)c2s1
Show InChI InChI=1S/C15H12N2O2S3/c1-20-10-4-2-9(3-5-10)12-6-11-14(22-12)15(17-8-16-11)21-7-13(18)19/h2-6,8H,7H2,1H3,(H,18,19)
NCI pathway
Reactome pathway
n/an/a 3.40E+4n/an/an/an/an/an/a
Pfizer Inc.
Curated by ChEMBL
Assay Description
Inhibition of TPL2
Bioorg Med Chem Lett 21: 5952-6 (2011)
Article DOI: 10.1016/j.bmcl.2011.07.069
BindingDB Entry DOI: 10.7270/Q2X63NC0
Serine/threonine-protein kinase 17A
(Homo sapiens (Human))
BDBM50354565
(CHEMBL1836719)
Show SMILES CSc1ccc(cc1)-c1cc2ncnc(SCC(O)=O)c2s1
Show InChI InChI=1S/C15H12N2O2S3/c1-20-10-4-2-9(3-5-10)12-6-11-14(22-12)15(17-8-16-11)21-7-13(18)19/h2-6,8H,7H2,1H3,(H,18,19)
n/an/an/a 230n/an/an/an/an/a
TBA
Citation and Details
Serine/threonine-protein kinase 17B (STK17B)
(Homo sapiens (Human))
BDBM50354565
(CHEMBL1836719)
Show SMILES CSc1ccc(cc1)-c1cc2ncnc(SCC(O)=O)c2s1
Show InChI InChI=1S/C15H12N2O2S3/c1-20-10-4-2-9(3-5-10)12-6-11-14(22-12)15(17-8-16-11)21-7-13(18)19/h2-6,8H,7H2,1H3,(H,18,19)
n/an/a 210n/an/an/an/an/an/a
TBA
Citation and Details
3D
3D Structure (crystal)
Serine/threonine-protein kinase 17B (STK17B)
(Homo sapiens (Human))
BDBM50354565
(CHEMBL1836719)
Show SMILES CSc1ccc(cc1)-c1cc2ncnc(SCC(O)=O)c2s1
Show InChI InChI=1S/C15H12N2O2S3/c1-20-10-4-2-9(3-5-10)12-6-11-14(22-12)15(17-8-16-11)21-7-13(18)19/h2-6,8H,7H2,1H3,(H,18,19)
n/an/a 20n/an/an/an/an/an/a
TBA
Citation and Details
3D
3D Structure (crystal)
Serine/threonine-protein kinase 17B (STK17B)
(Homo sapiens (Human))
BDBM50354565
(CHEMBL1836719)
Show SMILES CSc1ccc(cc1)-c1cc2ncnc(SCC(O)=O)c2s1
Show InChI InChI=1S/C15H12N2O2S3/c1-20-10-4-2-9(3-5-10)12-6-11-14(22-12)15(17-8-16-11)21-7-13(18)19/h2-6,8H,7H2,1H3,(H,18,19)
n/an/an/a 3.80n/an/an/an/an/a
TBA
Citation and Details
3D
3D Structure (crystal)