BDBM50354645 CHEMBL1834219
SMILES: C[C@@H](NC(=O)[C@@H](N)Cc1c(C)cc(O)cc1C)C(=O)N[C@@H]1[C@H](C)c2ccccc2CN(CC(N)=O)C1=O
InChI Key: InChIKey=MRCAQWKACIKITP-JXLUEJIVSA-N
Data: 2 KI  1 EC50
Activity Spreadsheet -- Enzyme Inhibition Constant Data from BindingDB
Found 3 hits for monomerid = 50354645
Trg + Lig
Ki
nM
ΔG°
kcal/mole
IC50
nM
Kd
nM
EC50/IC50
nM
koff
s-1
kon
M-1s-1
pHTemp
°C
Mu-type opioid receptor
(Rattus norvegicus (rat))
BDBM50354645
(CHEMBL1834219)
Show SMILES C[C@@H](NC(=O)[C@@H](N)Cc1c(C)cc(O)cc1C)C(=O)N[C@@H]1[C@H](C)c2ccccc2CN(CC(N)=O)C1=O |r|
Show InChI InChI=1S/C27H35N5O5/c1-14-9-19(33)10-15(2)21(14)11-22(28)26(36)30-17(4)25(35)31-24-16(3)20-8-6-5-7-18(20)12-32(27(24)37)13-23(29)34/h5-10,16-17,22,24,33H,11-13,28H2,1-4H3,(H2,29,34)(H,30,36)(H,31,35)/t16-,17-,22+,24-/m1/s1
Reactome pathway
0.400n/an/an/an/an/an/an/an/a
Vrije Universiteit Brussel
Curated by ChEMBL
Assay Description
Displacement of [3H]DAMGO from rat brain Mu-type opioid receptor by liquid scintillation counting
J Med Chem 54: 6538-47 (2011)
Article DOI: 10.1021/jm2003574
BindingDB Entry DOI: 10.7270/Q24Q7VC1
Opioid receptors; mu & delta
(Rattus norvegicus (rat))
BDBM50354645
(CHEMBL1834219)
Show SMILES C[C@@H](NC(=O)[C@@H](N)Cc1c(C)cc(O)cc1C)C(=O)N[C@@H]1[C@H](C)c2ccccc2CN(CC(N)=O)C1=O |r|
Show InChI InChI=1S/C27H35N5O5/c1-14-9-19(33)10-15(2)21(14)11-22(28)26(36)30-17(4)25(35)31-24-16(3)20-8-6-5-7-18(20)12-32(27(24)37)13-23(29)34/h5-10,16-17,22,24,33H,11-13,28H2,1-4H3,(H2,29,34)(H,30,36)(H,31,35)/t16-,17-,22+,24-/m1/s1
Reactome pathway
490n/an/an/an/an/an/an/an/a
Vrije Universiteit Brussel
Curated by ChEMBL
Assay Description
Displacement of [3H]Ile-deltorphin-2 from rat brain delta-type opioid receptor by liquid scintillation counting
J Med Chem 54: 6538-47 (2011)
Article DOI: 10.1021/jm2003574
BindingDB Entry DOI: 10.7270/Q24Q7VC1
Mu-type opioid receptor
(Rattus norvegicus (rat))
BDBM50354645
(CHEMBL1834219)
Show SMILES C[C@@H](NC(=O)[C@@H](N)Cc1c(C)cc(O)cc1C)C(=O)N[C@@H]1[C@H](C)c2ccccc2CN(CC(N)=O)C1=O |r|
Show InChI InChI=1S/C27H35N5O5/c1-14-9-19(33)10-15(2)21(14)11-22(28)26(36)30-17(4)25(35)31-24-16(3)20-8-6-5-7-18(20)12-32(27(24)37)13-23(29)34/h5-10,16-17,22,24,33H,11-13,28H2,1-4H3,(H2,29,34)(H,30,36)(H,31,35)/t16-,17-,22+,24-/m1/s1
Reactome pathway
n/an/an/an/a 184n/an/an/an/a
Vrije Universiteit Brussel
Curated by ChEMBL
Assay Description
Agonist activity at rat brain mu-opioid receptor assessed as [35S]GTPgammaS binding by liquid scintillation counting
J Med Chem 54: 6538-47 (2011)
Article DOI: 10.1021/jm2003574
BindingDB Entry DOI: 10.7270/Q24Q7VC1