BDBM50354812 CHEMBL1834095
SMILES: CSc1nc(N)nc(n1)-c1ccccc1Cl
InChI Key: InChIKey=JVOIPLKVZOLUDL-UHFFFAOYSA-N
Data: 1 IC50  1 Kd
PDB links: 1 PDB ID matches this monomer.
Activity Spreadsheet -- Enzyme Inhibition Constant Data from BindingDB
Found 2 hits for monomerid = 50354812
Trg + Lig
Ki
nM
ΔG°
kcal/mole
IC50
nM
Kd
nM
EC50/IC50
nM
koff
s-1
kon
M-1s-1
pHTemp
°C
Heat shock protein HSP 90-alpha
(Homo sapiens (Human))
BDBM50354812
(CHEMBL1834095)
Show SMILES CSc1nc(N)nc(n1)-c1ccccc1Cl
Show InChI InChI=1S/C10H9ClN4S/c1-16-10-14-8(13-9(12)15-10)6-4-2-3-5-7(6)11/h2-5H,1H3,(H2,12,13,14,15)
NCI pathway
Reactome pathway
n/an/an/a 6.90E+3n/an/an/an/an/a
Chugai Pharmaceutical Co., Ltd
Curated by ChEMBL
Assay Description
Binding affinity to human HSP90alpha assessed as 2D1H-15N chemical shift perturbation by NMR spectroscopy
Bioorg Med Chem Lett 21: 5778-83 (2011)
Checked by Author
Article DOI: 10.1016/j.bmcl.2011.08.001
BindingDB Entry DOI: 10.7270/Q2QJ7HQX
3D
3D Structure (crystal)
Heat shock protein HSP 90-alpha
(Homo sapiens (Human))
BDBM50354812
(CHEMBL1834095)
Show SMILES CSc1nc(N)nc(n1)-c1ccccc1Cl
Show InChI InChI=1S/C10H9ClN4S/c1-16-10-14-8(13-9(12)15-10)6-4-2-3-5-7(6)11/h2-5H,1H3,(H2,12,13,14,15)
NCI pathway
Reactome pathway
n/an/a 750n/an/an/an/an/an/a
Chugai Pharmaceutical Co., Ltd
Curated by ChEMBL
Assay Description
Inhibition of human N-terminal GST-tagged HSP90alpha expressed in Escherichia coli after 1 hr using 10 mM of ATP and malachite green by microplate re...
Bioorg Med Chem Lett 21: 5778-83 (2011)
Checked by Author
Article DOI: 10.1016/j.bmcl.2011.08.001
BindingDB Entry DOI: 10.7270/Q2QJ7HQX
3D
3D Structure (crystal)