BDBM50354888 CHEMBL1837033
SMILES: Clc1cccc-2c1COCc1nnc(C3CCN(CC3)c3ccccn3)n-21
InChI Key: InChIKey=OAIAMBIVJLJTJI-UHFFFAOYSA-N
Data: 1 IC50
Activity Spreadsheet -- Enzyme Inhibition Constant Data from BindingDB
Found 1 hit for monomerid = 50354888
Trg + Lig
Ki
nM
ΔG°
kcal/mole
IC50
nM
Kd
nM
EC50/IC50
nM
koff
s-1
kon
M-1s-1
pHTemp
°C
Vasopressin V1a receptor
(Homo sapiens (Human))
BDBM50354888
(CHEMBL1837033)
Show SMILES Clc1cccc-2c1COCc1nnc(C3CCN(CC3)c3ccccn3)n-21
Show InChI InChI=1S/C20H20ClN5O/c21-16-4-3-5-17-15(16)12-27-13-19-23-24-20(26(17)19)14-7-10-25(11-8-14)18-6-1-2-9-22-18/h1-6,9,14H,7-8,10-13H2
n/an/a 904n/an/an/an/an/an/a
Pfizer Inc.
Curated by ChEMBL
Assay Description
Antagonist activity at human V1A receptor expressed in CHO cells assessed as inhibition of AVP-induced intracellular calcium release after 30 seconds...
Bioorg Med Chem Lett 21: 5684-7 (2011)
Article DOI: 10.1016/j.bmcl.2011.08.038
BindingDB Entry DOI: 10.7270/Q2TB179T