BDBM50354908 CHEMBL1837036
SMILES: CN1Cc2nnc(C3CCN(CC3)c3ccccn3)n2-c2ccccc2C1
InChI Key: InChIKey=FMXWVYWEWRLGDS-UHFFFAOYSA-N
Data: 1 IC50
Activity Spreadsheet -- Enzyme Inhibition Constant Data from BindingDB
Found 1 hit for monomerid = 50354908
Trg + Lig
Ki
nM
ΔG°
kcal/mole
IC50
nM
Kd
nM
EC50/IC50
nM
koff
s-1
kon
M-1s-1
pHTemp
°C
Vasopressin V1a receptor
(Homo sapiens (Human))
BDBM50354908
(CHEMBL1837036)
Show SMILES CN1Cc2nnc(C3CCN(CC3)c3ccccn3)n2-c2ccccc2C1
Show InChI InChI=1S/C21H24N6/c1-25-14-17-6-2-3-7-18(17)27-20(15-25)23-24-21(27)16-9-12-26(13-10-16)19-8-4-5-11-22-19/h2-8,11,16H,9-10,12-15H2,1H3
n/an/a 272n/an/an/an/an/an/a
Pfizer Inc.
Curated by ChEMBL
Assay Description
Antagonist activity at human V1A receptor expressed in CHO cells assessed as inhibition of AVP-induced intracellular calcium release after 30 seconds...
Bioorg Med Chem Lett 21: 5684-7 (2011)
Article DOI: 10.1016/j.bmcl.2011.08.038
BindingDB Entry DOI: 10.7270/Q2TB179T