BDBM50354913 CHEMBL1837028
SMILES: Clc1cccc(Cn2c(Cn3nccn3)nnc2C2CCN(CC2)c2ccccn2)c1
InChI Key: InChIKey=UQUNYRCRIJTIHK-UHFFFAOYSA-N
Data: 1 IC50
Activity Spreadsheet -- Enzyme Inhibition Constant Data from BindingDB
Found 1 hit for monomerid = 50354913
Trg + Lig
Ki
nM
ΔG°
kcal/mole
IC50
nM
Kd
nM
EC50/IC50
nM
koff
s-1
kon
M-1s-1
pHTemp
°C
Vasopressin V1a receptor
(Homo sapiens (Human))
BDBM50354913
(CHEMBL1837028)
Show SMILES Clc1cccc(Cn2c(Cn3nccn3)nnc2C2CCN(CC2)c2ccccn2)c1
Show InChI InChI=1S/C22H23ClN8/c23-19-5-3-4-17(14-19)15-30-21(16-31-25-10-11-26-31)27-28-22(30)18-7-12-29(13-8-18)20-6-1-2-9-24-20/h1-6,9-11,14,18H,7-8,12-13,15-16H2
n/an/a 3n/an/an/an/an/an/a
Pfizer Inc.
Curated by ChEMBL
Assay Description
Antagonist activity at human V1A receptor expressed in CHO cells assessed as inhibition of AVP-induced intracellular calcium release after 30 seconds...
Bioorg Med Chem Lett 21: 5684-7 (2011)
Article DOI: 10.1016/j.bmcl.2011.08.038
BindingDB Entry DOI: 10.7270/Q2TB179T