BDBM50354916 CHEMBL1837031
SMILES: Clc1ccc-2c(COCc3nnc(C4CCN(CC4)c4ccccn4)n-23)c1
InChI Key: InChIKey=AQPGHFQMSUAWHT-UHFFFAOYSA-N
Data: 1 IC50
Activity Spreadsheet -- Enzyme Inhibition Constant Data from BindingDB
Found 1 hit for monomerid = 50354916
Trg + Lig
Ki
nM
ΔG°
kcal/mole
IC50
nM
Kd
nM
EC50/IC50
nM
koff
s-1
kon
M-1s-1
pHTemp
°C
Vasopressin V1a receptor
(Homo sapiens (Human))
BDBM50354916
(CHEMBL1837031)
Show SMILES Clc1ccc-2c(COCc3nnc(C4CCN(CC4)c4ccccn4)n-23)c1
Show InChI InChI=1S/C20H20ClN5O/c21-16-4-5-17-15(11-16)12-27-13-19-23-24-20(26(17)19)14-6-9-25(10-7-14)18-3-1-2-8-22-18/h1-5,8,11,14H,6-7,9-10,12-13H2
n/an/a 17n/an/an/an/an/an/a
Pfizer Inc.
Curated by ChEMBL
Assay Description
Antagonist activity at human V1A receptor expressed in CHO cells assessed as inhibition of AVP-induced intracellular calcium release after 30 seconds...
Bioorg Med Chem Lett 21: 5684-7 (2011)
Article DOI: 10.1016/j.bmcl.2011.08.038
BindingDB Entry DOI: 10.7270/Q2TB179T