BDBM50355004 CHEMBL1834956
SMILES: OC(=O)c1cc(\C=C\c2ccc(cc2)S(=O)(=O)Nc2ccccn2)ccc1O
InChI Key: InChIKey=UAHMKJJFOGZIDP-SNAWJCMRSA-N
Data: 2 IC50
Activity Spreadsheet -- Enzyme Inhibition Constant Data from BindingDB
Found 2 hits for monomerid = 50355004
Trg + Lig
Ki
nM
ΔG°
kcal/mole
IC50
nM
Kd
nM
EC50/IC50
nM
koff
s-1
kon
M-1s-1
pHTemp
°C
Cystine/glutamate transporter
(Homo sapiens (Human))
BDBM50355004
(CHEMBL1834956)
Show SMILES OC(=O)c1cc(\C=C\c2ccc(cc2)S(=O)(=O)Nc2ccccn2)ccc1O
Show InChI InChI=1S/C20H16N2O5S/c23-18-11-8-15(13-17(18)20(24)25)5-4-14-6-9-16(10-7-14)28(26,27)22-19-3-1-2-12-21-19/h1-13,23H,(H,21,22)(H,24,25)/b5-4+
Reactome pathway
n/an/a 3.00E+4n/an/an/an/an/an/a
China Pharmaceutical University
Curated by ChEMBL
Assay Description
Inhibition of xCT-mediated cystein/glutamate transporter (unknown origin) assessed as reduction in L-[14C]cyctein uptake
Eur J Med Chem 163: 215-242 (2019)
Article DOI: 10.1016/j.ejmech.2018.11.066
Cystine/glutamate transporter
(Homo sapiens (Human))
BDBM50355004
(CHEMBL1834956)
Show SMILES OC(=O)c1cc(\C=C\c2ccc(cc2)S(=O)(=O)Nc2ccccn2)ccc1O
Show InChI InChI=1S/C20H16N2O5S/c23-18-11-8-15(13-17(18)20(24)25)5-4-14-6-9-16(10-7-14)28(26,27)22-19-3-1-2-12-21-19/h1-13,23H,(H,21,22)(H,24,25)/b5-4+
Reactome pathway
n/an/a 7.00E+4n/an/an/an/an/an/a
Johns Hopkins University
Curated by ChEMBL
Assay Description
Inhibition of xc-cystine-glutamate antiporter-mediated cystine uptake in human U87 cells using L-[14C]cystine as substrate after 15 mins by liquid sc...
Bioorg Med Chem Lett 21: 6184-7 (2011)
Article DOI: 10.1016/j.bmcl.2011.07.081
BindingDB Entry DOI: 10.7270/Q21V5FCR