BDBM50355009 CHEMBL1614646
SMILES: Cc1cccnc1NS(=O)(=O)c1ccc(cc1)C#Cc1ccc(O)c(c1)C(O)=O
InChI Key: InChIKey=WJLQPSZXCOYTHS-UHFFFAOYSA-N
Data: 1 IC50
Activity Spreadsheet -- Enzyme Inhibition Constant Data from BindingDB
Found 1 hit for monomerid = 50355009
Trg + Lig
Ki
nM
ΔG°
kcal/mole
IC50
nM
Kd
nM
EC50/IC50
nM
koff
s-1
kon
M-1s-1
pHTemp
°C
Cystine/glutamate transporter
(Homo sapiens (Human))
BDBM50355009
(CHEMBL1614646)
Show SMILES Cc1cccnc1NS(=O)(=O)c1ccc(cc1)C#Cc1ccc(O)c(c1)C(O)=O
Show InChI InChI=1S/C21H16N2O5S/c1-14-3-2-12-22-20(14)23-29(27,28)17-9-6-15(7-10-17)4-5-16-8-11-19(24)18(13-16)21(25)26/h2-3,6-13,24H,1H3,(H,22,23)(H,25,26)
Reactome pathway
n/an/a 7.00E+4n/an/an/an/an/an/a
Johns Hopkins University
Curated by ChEMBL
Assay Description
Inhibition of xc-cystine-glutamate antiporter-mediated cystine uptake in human U87 cells using L-[14C]cystine as substrate after 15 mins by liquid sc...
Bioorg Med Chem Lett 21: 6184-7 (2011)
Article DOI: 10.1016/j.bmcl.2011.07.081
BindingDB Entry DOI: 10.7270/Q21V5FCR