BDBM50355114 CHEMBL1342017
SMILES: Cc1ccc(\C=C2/C(=O)ON=C2c2ccccc2)o1
InChI Key: InChIKey=VFAQKHZBOKAOSQ-LCYFTJDESA-N
Data: 1 IC50
Activity Spreadsheet -- Enzyme Inhibition Constant Data from BindingDB
Found 1 hit for monomerid = 50355114
Trg + Lig
Ki
nM
ΔG°
kcal/mole
IC50
nM
Kd
nM
EC50/IC50
nM
koff
s-1
kon
M-1s-1
pHTemp
°C
4-diphosphocytidyl-2-C-methyl-D-erythritol kinase
(Yersinia pestis)
BDBM50355114
(CHEMBL1342017)
Show SMILES Cc1ccc(\C=C2/C(=O)ON=C2c2ccccc2)o1 |c:10|
Show InChI InChI=1S/C15H11NO3/c1-10-7-8-12(18-10)9-13-14(16-19-15(13)17)11-5-3-2-4-6-11/h2-9H,1H3/b13-9-
n/an/a 1.30E+4n/an/an/an/an/an/a
University of Utah
Curated by ChEMBL
Assay Description
Inhibition of His6-tagged Yersinia pestis KIM6 CDP-ME kinase assessed as ADP production after 30 mins by Kinase Glo luminescence-based assay or stand...
Bioorg Med Chem 19: 5886-95 (2011)
Article DOI: 10.1016/j.bmc.2011.08.012
BindingDB Entry DOI: 10.7270/Q2W37WQJ