BDBM50355361 CHEMBL1835541
SMILES: C[C@]12CC[C@H]3[C@@H](CCc4c3ccc(O)c4[N+]([O-])=O)[C@@H]1CCC2=O
InChI Key: InChIKey=WNYWRAYXFFPPGN-QDTBLXIISA-N
Data: 1 KI  1 IC50
Activity Spreadsheet -- Enzyme Inhibition Constant Data from BindingDB
Found 2 hits for monomerid = 50355361
Trg + Lig
Ki
nM
ΔG°
kcal/mole
IC50
nM
Kd
nM
EC50/IC50
nM
koff
s-1
kon
M-1s-1
pHTemp
°C
Steryl-sulfatase
(Homo sapiens (Human))
BDBM50355361
(CHEMBL1835541)
Show SMILES C[C@]12CC[C@H]3[C@@H](CCc4c3ccc(O)c4[N+]([O-])=O)[C@@H]1CCC2=O |r|
Show InChI InChI=1S/C18H21NO4/c1-18-9-8-11-10-4-6-15(20)17(19(22)23)13(10)3-2-12(11)14(18)5-7-16(18)21/h4,6,11-12,14,20H,2-3,5,7-9H2,1H3/t11-,12-,14+,18+/m1/s1
1.40E+3n/an/an/an/an/an/an/an/a
University of Waterloo
Curated by ChEMBL
Assay Description
Non-Competitive inhibition of human steroid sulfatase using 4-methylumbelliferyl sulfate substrate by Lineweaver-Burk plot analysis
Bioorg Med Chem 19: 5999-6005 (2011)
Article DOI: 10.1016/j.bmc.2011.08.046
BindingDB Entry DOI: 10.7270/Q2FX79VJ
Steryl-sulfatase
(Homo sapiens (Human))
BDBM50355361
(CHEMBL1835541)
Show SMILES C[C@]12CC[C@H]3[C@@H](CCc4c3ccc(O)c4[N+]([O-])=O)[C@@H]1CCC2=O |r|
Show InChI InChI=1S/C18H21NO4/c1-18-9-8-11-10-4-6-15(20)17(19(22)23)13(10)3-2-12(11)14(18)5-7-16(18)21/h4,6,11-12,14,20H,2-3,5,7-9H2,1H3/t11-,12-,14+,18+/m1/s1
n/an/a 2.40E+3n/an/an/an/an/an/a
University of Waterloo
Curated by ChEMBL
Assay Description
Inhibition of human steroid sulfatase using 4-methylumbelliferyl sulfate substrate after 10 mins by fluorescence assay
Bioorg Med Chem 19: 5999-6005 (2011)
Article DOI: 10.1016/j.bmc.2011.08.046
BindingDB Entry DOI: 10.7270/Q2FX79VJ